• Reports by commit
  • Recent reports
  • Perl5 CoreSmokeDB
  • Changes
  • Smoke v5.39.2-85-gf87d08569b PASS netbsd 8.2 Intel 686-class 1

    Automated smoke report for branch blead 5.39.3 patch f87d08569b779eeb9445716e595090f23fdab8e0 v5.39.2-85-gf87d08569b.
    cjg-netbsd8: Intel 686-class (amd64/1 cpus)
        on        netbsd 8.2
        using     gcc version 5.5.0 (*1)
        smoketime 3 hours 4 minutes (average 23 minutes 7 seconds)
    Summary: PASS
    O = OK  F = Failure(s), extended report at the bottom
    X = Failure(s) under TEST but not under harness
    ? = still running or test results not (yet) available
    Build failures during:       - = unknown or N/A
    c = Configure, m = make, M = make (after miniperl), t = make test-prep
    ----------------------- ----------------------------------------------------
    O  O                    -Dcc=gcc (*1)
    O  O                    -Dcc=gcc -Duse64bitall (*1)
    O  O                    -Dcc=gcc -Duseithreads (*1)
    O  O                    -Dcc=gcc -Duseithreads -Duse64bitall (*1)
    |  |
    |  +------------------  stdio DEBUGGING
    +---------------------  stdio
    Testsuite was run only with 'harness'
    Skipped tests:
            # One test name on a line
    Test failures:
        Test todo-passed:
        ../lib/locale.t (683)
          [stdio] -Dcc=gcc -Duseithreads
          [stdio] -Dcc=gcc -Duse64bitall DEBUGGING
          [stdio] -Dcc=gcc DEBUGGING
          [stdio] -Dcc=gcc -Duse64bitall
          [stdio] -Dcc=gcc
          [stdio] -Dcc=gcc -Duseithreads DEBUGGING
          [stdio] -Dcc=gcc -Duseithreads -Duse64bitall DEBUGGING
          [stdio] -Dcc=gcc -Duseithreads -Duse64bitall
    Compiler messages:
        locale.c: In function 'Perl_init_i18nl10n':
        locale.c:1387:9: warning: 'msg' may be used uninitialized in this function [-Wmaybe-uninitialized]
        locale.c:1364:18: note: 'msg' was declared here
        /usr/include/sys/cdefs_elf.h:67:20: error: missing binary operator before token "("
        /usr/include/sys/cdefs_elf.h:73:20: error: missing binary operator before token "("
        /usr/include/sys/cdefs_elf.h:79:20: error: missing binary operator before token "("
        Socket.c: In function 'XS_Socket_pack_ip_mreq_source':
        Socket.c:1702:7: warning: variable 'interface' set but not used [-Wunused-but-set-variable]
        const-c.inc: In function 'constant_19':
        const-c.inc:351:42: warning: unused parameter 'iv_return' [-Wunused-parameter]
        locale.c: In function 'S_parse_LC_ALL_string':

    About this smoke:
    smoking-perl: 5.38.0
    smoker-version: 1.71/0.046
    timestamp: 2023-09-09T07:08:20Z
    tester: core