• Reports by commit
  • Recent reports
  • Perl5 CoreSmokeDB
  • Changes
  • Smoke v5.39.2-90-g4e6e60eea0 FAIL(F) darwin 22.4.0 (Mac OS X - macOS 13.3 (22E252)) Mac mini (0) [8 (4 performance and 4 efficiency) cores]

    Automated smoke report for branch blead 5.39.3 patch 4e6e60eea000b7c8dd2f1cad0c46f19efa04b559 v5.39.2-90-g4e6e60eea0.
    briandfoy-Macmini9-1: Mac mini (0) (arm64/ [8 (4 performance and 4 efficiency) cores] cpus)
        on        darwin 22.4.0 (Mac OS X - macOS 13.3 (22E252))
        using     cc version Apple LLVM 13.0.0 (clang-1300.0.29.30) (*1)
        smoketime 7 hours 32 minutes (average 56 minutes 37 seconds)
    
    Summary: FAIL(F)
    
    O = OK  F = Failure(s), extended report at the bottom
    X = Failure(s) under TEST but not under harness
    ? = still running or test results not (yet) available
    Build failures during:       - = unknown or N/A
    c = Configure, m = make, M = make (after miniperl), t = make test-prep
    
    v5.39.2-90-g4e6e60eea0
    ----------------------- ----------------------------------------------------
    O  O  O  O               (*1)
    O  O  O  O              -Duse64bitint (*1)
    F  F  F  F              -Duseithreads (*1)
    F  F  F  F              -Duseithreads -Duse64bitint (*1)
    |  |  |  |
    |  |  |  +------------  perlio DEBUGGING
    |  |  +---------------  stdio DEBUGGING
    |  +------------------  perlio
    +---------------------  stdio
    
    Skipped tests:
            # One test name on a line
    
    Test failures:
      ../lib/locale.t (FAILED 427-428 432 435 449)
          [stdio/perlio] -Duseithreads
          [stdio/perlio] -Duseithreads DEBUGGING
          [stdio/perlio] -Duseithreads -Duse64bitint
          [stdio/perlio] -Duseithreads -Duse64bitint DEBUGGING
    
      ../ext/XS-APItest/t/locale.t (FAILED 9)
          [stdio/perlio] -Duseithreads
          [stdio/perlio] -Duseithreads DEBUGGING
          [stdio/perlio] -Duseithreads -Duse64bitint
          [stdio/perlio] -Duseithreads -Duse64bitint DEBUGGING
    
      ../t/run/locale.t (FAILED 8-9 11-27 30-32 37-38)
          [stdio/perlio] -Duseithreads -Duse64bitint
          [stdio/perlio] -Duseithreads -Duse64bitint DEBUGGING
          [stdio/perlio] -Duseithreads
          [stdio/perlio] -Duseithreads DEBUGGING
    
      ../dist/threads/t/blocks.t (FAILED at test 2 )
          [stdio] -Duseithreads -Duse64bitint
    
    Compiler messages:
        None.
    

    About this smoke:
    smoking-perl: 5.34.0
    smoker-version: 1.78/0.046
    timestamp: 2023-09-11T10:33:05Z
    tester: brian