• Reports by commit
  • Recent reports
  • Perl5 CoreSmokeDB
  • Changes
  • Smoke v5.39.2-114-g65cfe011fc FAIL(F) MSWin32 Win10 Build 19045 (64-bit) AMD Ryzen 7 5700G with Radeon Graphics (~3793 MHz) 2

    Automated smoke report for branch blead 5.39.3 patch 65cfe011fc59931f80068f0ed2428515002bcbc2 v5.39.2-114-g65cfe011fc.
    winbonne10: AMD Ryzen 7 5700G with Radeon Graphics (~3793 MHz) (amd64/2 cpus)
        on        MSWin32 Win10 Build 19045 (64-bit)
        using     gcc version 13.2.0 (*1)
        smoketime 8 hours 8 minutes (average 48 minutes 49 seconds)
    
    Summary: FAIL(F)
    
    O = OK  F = Failure(s), extended report at the bottom
    X = Failure(s) under TEST but not under harness
    ? = still running or test results not (yet) available
    Build failures during:       - = unknown or N/A
    c = Configure, m = make, M = make (after miniperl), t = make test-prep
    
    v5.39.2-114-g65cfe011fc
    ----------------------- ----------------------------------------------------
    F  F                    -DCCTYPE=GCC -DCCHOME=C:\mingw64 -Duselargefiles -Uuseithreads (*1)
    F  F                    -DCCTYPE=GCC -DCCHOME=C:\mingw64 -Duselargefiles (*1)
    F  F                    -DCCTYPE=GCC -DCCHOME=C:\mingw64 -Duselargefiles -Duselongdouble (*1)
    F  F                    -DCCTYPE=GCC -DCCHOME=C:\mingw64 -Duselargefiles -Dusequadmath (*1)
    F  F                    -DCCTYPE=GCC -DCCHOME=C:\mingw64 -Duselargefiles -UWIN64 -Duse64bitint (*1)
    |  |
    |  +------------------  stdio DEBUGGING
    +---------------------  stdio
    
      Applied patches:
        SMOKE65cfe011fc59931f80068f0ed2428515002bcbc2
    Skipped tests:
        None.
    
    Test failures:
      ../t/porting/regen.t (FAILED 38 Non-zero exit status: 255 Bad plan. You planned 43 tests but ran 40.)
          [stdio] -DCCTYPE=GCC -DCCHOME=C:\mingw64 -Duselargefiles -Dusequadmath
          [stdio] -DCCTYPE=GCC -DCCHOME=C:\mingw64 -Duselargefiles -Duselongdouble
          [stdio] -DCCTYPE=GCC -DCCHOME=C:\mingw64 -Duselargefiles -Uuseithreads
          [stdio] -DCCTYPE=GCC -DCCHOME=C:\mingw64 -Duselargefiles -Duselongdouble DEBUGGING
          [stdio] -DCCTYPE=GCC -DCCHOME=C:\mingw64 -Duselargefiles -Dusequadmath DEBUGGING
          [stdio] -DCCTYPE=GCC -DCCHOME=C:\mingw64 -Duselargefiles DEBUGGING
          [stdio] -DCCTYPE=GCC -DCCHOME=C:\mingw64 -Duselargefiles -UWIN64 -Duse64bitint DEBUGGING
          [stdio] -DCCTYPE=GCC -DCCHOME=C:\mingw64 -Duselargefiles -Uuseithreads DEBUGGING
          [stdio] -DCCTYPE=GCC -DCCHOME=C:\mingw64 -Duselargefiles
          [stdio] -DCCTYPE=GCC -DCCHOME=C:\mingw64 -Duselargefiles -UWIN64 -Duse64bitint
    
      ../cpan/CPAN-Meta-YAML/t/32_world_tml.t (FAILED Non-zero exit status: 2 No plan found in TAP output)
          [stdio] -DCCTYPE=GCC -DCCHOME=C:\mingw64 -Duselargefiles -Uuseithreads
          [stdio] -DCCTYPE=GCC -DCCHOME=C:\mingw64 -Duselargefiles -Dusequadmath
          [stdio] -DCCTYPE=GCC -DCCHOME=C:\mingw64 -Duselargefiles -Duselongdouble
          [stdio] -DCCTYPE=GCC -DCCHOME=C:\mingw64 -Duselargefiles -Dusequadmath DEBUGGING
          [stdio] -DCCTYPE=GCC -DCCHOME=C:\mingw64 -Duselargefiles DEBUGGING
          [stdio] -DCCTYPE=GCC -DCCHOME=C:\mingw64 -Duselargefiles -Duselongdouble DEBUGGING
          [stdio] -DCCTYPE=GCC -DCCHOME=C:\mingw64 -Duselargefiles -Uuseithreads DEBUGGING
          [stdio] -DCCTYPE=GCC -DCCHOME=C:\mingw64 -Duselargefiles -UWIN64 -Duse64bitint DEBUGGING
          [stdio] -DCCTYPE=GCC -DCCHOME=C:\mingw64 -Duselargefiles -UWIN64 -Duse64bitint
          [stdio] -DCCTYPE=GCC -DCCHOME=C:\mingw64 -Duselargefiles
    
      ../t/porting/customized.t (FAILED 1-18)
          [stdio] -DCCTYPE=GCC -DCCHOME=C:\mingw64 -Duselargefiles -Dusequadmath DEBUGGING
          [stdio] -DCCTYPE=GCC -DCCHOME=C:\mingw64 -Duselargefiles DEBUGGING
          [stdio] -DCCTYPE=GCC -DCCHOME=C:\mingw64 -Duselargefiles -Duselongdouble DEBUGGING
          [stdio] -DCCTYPE=GCC -DCCHOME=C:\mingw64 -Duselargefiles -Uuseithreads
          [stdio] -DCCTYPE=GCC -DCCHOME=C:\mingw64 -Duselargefiles -Dusequadmath
          [stdio] -DCCTYPE=GCC -DCCHOME=C:\mingw64 -Duselargefiles -Duselongdouble
          [stdio] -DCCTYPE=GCC -DCCHOME=C:\mingw64 -Duselargefiles -UWIN64 -Duse64bitint
          [stdio] -DCCTYPE=GCC -DCCHOME=C:\mingw64 -Duselargefiles
          [stdio] -DCCTYPE=GCC -DCCHOME=C:\mingw64 -Duselargefiles -Uuseithreads DEBUGGING
          [stdio] -DCCTYPE=GCC -DCCHOME=C:\mingw64 -Duselargefiles -UWIN64 -Duse64bitint DEBUGGING
    
      ../t/win32/system.t (FAILED 1-672 1513-1680 Bad plan. You planned 1512 tests but ran 1680.)
          [stdio] -DCCTYPE=GCC -DCCHOME=C:\mingw64 -Duselargefiles -Duselongdouble DEBUGGING
          [stdio] -DCCTYPE=GCC -DCCHOME=C:\mingw64 -Duselargefiles -Uuseithreads DEBUGGING
    
      ../t/porting/pod_rules.t (FAILED 2-5 Bad plan. You planned 7 tests but ran 5.)
          [stdio] -DCCTYPE=GCC -DCCHOME=C:\mingw64 -Duselargefiles -UWIN64 -Duse64bitint DEBUGGING
          [stdio] -DCCTYPE=GCC -DCCHOME=C:\mingw64 -Duselargefiles -Uuseithreads DEBUGGING
          [stdio] -DCCTYPE=GCC -DCCHOME=C:\mingw64 -Duselargefiles
          [stdio] -DCCTYPE=GCC -DCCHOME=C:\mingw64 -Duselargefiles -UWIN64 -Duse64bitint
          [stdio] -DCCTYPE=GCC -DCCHOME=C:\mingw64 -Duselargefiles -Duselongdouble
          [stdio] -DCCTYPE=GCC -DCCHOME=C:\mingw64 -Duselargefiles -Dusequadmath
          [stdio] -DCCTYPE=GCC -DCCHOME=C:\mingw64 -Duselargefiles -Uuseithreads
          [stdio] -DCCTYPE=GCC -DCCHOME=C:\mingw64 -Duselargefiles -Duselongdouble DEBUGGING
          [stdio] -DCCTYPE=GCC -DCCHOME=C:\mingw64 -Duselargefiles DEBUGGING
          [stdio] -DCCTYPE=GCC -DCCHOME=C:\mingw64 -Duselargefiles -Dusequadmath DEBUGGING
    
      ../t/win32/system.t (FAILED 1-336 Bad plan. You planned 1512 tests but ran 1344.)
          [stdio] -DCCTYPE=GCC -DCCHOME=C:\mingw64 -Duselargefiles -Uuseithreads
          [stdio] -DCCTYPE=GCC -DCCHOME=C:\mingw64 -Duselargefiles -Duselongdouble
          [stdio] -DCCTYPE=GCC -DCCHOME=C:\mingw64 -Duselargefiles -UWIN64 -Duse64bitint
          [stdio] -DCCTYPE=GCC -DCCHOME=C:\mingw64 -Duselargefiles
    
      ../cpan/CPAN-Meta-YAML/t/31_local_tml.t (FAILED Non-zero exit status: 2 No plan found in TAP output)
          [stdio] -DCCTYPE=GCC -DCCHOME=C:\mingw64 -Duselargefiles -UWIN64 -Duse64bitint
          [stdio] -DCCTYPE=GCC -DCCHOME=C:\mingw64 -Duselargefiles
          [stdio] -DCCTYPE=GCC -DCCHOME=C:\mingw64 -Duselargefiles -Uuseithreads DEBUGGING
          [stdio] -DCCTYPE=GCC -DCCHOME=C:\mingw64 -Duselargefiles -UWIN64 -Duse64bitint DEBUGGING
          [stdio] -DCCTYPE=GCC -DCCHOME=C:\mingw64 -Duselargefiles -Dusequadmath DEBUGGING
          [stdio] -DCCTYPE=GCC -DCCHOME=C:\mingw64 -Duselargefiles DEBUGGING
          [stdio] -DCCTYPE=GCC -DCCHOME=C:\mingw64 -Duselargefiles -Duselongdouble DEBUGGING
          [stdio] -DCCTYPE=GCC -DCCHOME=C:\mingw64 -Duselargefiles -Uuseithreads
          [stdio] -DCCTYPE=GCC -DCCHOME=C:\mingw64 -Duselargefiles -Dusequadmath
          [stdio] -DCCTYPE=GCC -DCCHOME=C:\mingw64 -Duselargefiles -Duselongdouble
    
      ../dist/ExtUtils-CBuilder/t/00-have-compiler.t (FAILED 5 Non-zero exit status: 1)
          [stdio] -DCCTYPE=GCC -DCCHOME=C:\mingw64 -Duselargefiles
          [stdio] -DCCTYPE=GCC -DCCHOME=C:\mingw64 -Duselargefiles -UWIN64 -Duse64bitint
          [stdio] -DCCTYPE=GCC -DCCHOME=C:\mingw64 -Duselargefiles -UWIN64 -Duse64bitint DEBUGGING
          [stdio] -DCCTYPE=GCC -DCCHOME=C:\mingw64 -Duselargefiles -Uuseithreads DEBUGGING
          [stdio] -DCCTYPE=GCC -DCCHOME=C:\mingw64 -Duselargefiles -Duselongdouble DEBUGGING
          [stdio] -DCCTYPE=GCC -DCCHOME=C:\mingw64 -Duselargefiles -Dusequadmath DEBUGGING
          [stdio] -DCCTYPE=GCC -DCCHOME=C:\mingw64 -Duselargefiles DEBUGGING
          [stdio] -DCCTYPE=GCC -DCCHOME=C:\mingw64 -Duselargefiles -Dusequadmath
          [stdio] -DCCTYPE=GCC -DCCHOME=C:\mingw64 -Duselargefiles -Duselongdouble
          [stdio] -DCCTYPE=GCC -DCCHOME=C:\mingw64 -Duselargefiles -Uuseithreads
    
      ../cpan/CPAN-Meta-YAML/t/30_yaml_spec_tml.t (FAILED Non-zero exit status: 2 No plan found in TAP output)
          [stdio] -DCCTYPE=GCC -DCCHOME=C:\mingw64 -Duselargefiles -Uuseithreads DEBUGGING
          [stdio] -DCCTYPE=GCC -DCCHOME=C:\mingw64 -Duselargefiles -UWIN64 -Duse64bitint DEBUGGING
          [stdio] -DCCTYPE=GCC -DCCHOME=C:\mingw64 -Duselargefiles -UWIN64 -Duse64bitint
          [stdio] -DCCTYPE=GCC -DCCHOME=C:\mingw64 -Duselargefiles
          [stdio] -DCCTYPE=GCC -DCCHOME=C:\mingw64 -Duselargefiles -Uuseithreads
          [stdio] -DCCTYPE=GCC -DCCHOME=C:\mingw64 -Duselargefiles -Duselongdouble
          [stdio] -DCCTYPE=GCC -DCCHOME=C:\mingw64 -Duselargefiles -Dusequadmath
          [stdio] -DCCTYPE=GCC -DCCHOME=C:\mingw64 -Duselargefiles -Dusequadmath DEBUGGING
          [stdio] -DCCTYPE=GCC -DCCHOME=C:\mingw64 -Duselargefiles DEBUGGING
          [stdio] -DCCTYPE=GCC -DCCHOME=C:\mingw64 -Duselargefiles -Duselongdouble DEBUGGING
    
        Test todo-passed:
        ../dist/Net-Ping/t/450_service.t (9)
          [stdio] -DCCTYPE=GCC -DCCHOME=C:\mingw64 -Duselargefiles -Dusequadmath
          [stdio] -DCCTYPE=GCC -DCCHOME=C:\mingw64 -Duselargefiles -UWIN64 -Duse64bitint DEBUGGING
        ../ext/IPC-Open3/t/IPC-Open3.t (25)
          [stdio] -DCCTYPE=GCC -DCCHOME=C:\mingw64 -Duselargefiles -UWIN64 -Duse64bitint
          [stdio] -DCCTYPE=GCC -DCCHOME=C:\mingw64 -Duselargefiles
          [stdio] -DCCTYPE=GCC -DCCHOME=C:\mingw64 -Duselargefiles -Uuseithreads DEBUGGING
          [stdio] -DCCTYPE=GCC -DCCHOME=C:\mingw64 -Duselargefiles -UWIN64 -Duse64bitint DEBUGGING
          [stdio] -DCCTYPE=GCC -DCCHOME=C:\mingw64 -Duselargefiles DEBUGGING
          [stdio] -DCCTYPE=GCC -DCCHOME=C:\mingw64 -Duselargefiles -Dusequadmath DEBUGGING
          [stdio] -DCCTYPE=GCC -DCCHOME=C:\mingw64 -Duselargefiles -Duselongdouble DEBUGGING
          [stdio] -DCCTYPE=GCC -DCCHOME=C:\mingw64 -Duselargefiles -Uuseithreads
          [stdio] -DCCTYPE=GCC -DCCHOME=C:\mingw64 -Duselargefiles -Dusequadmath
          [stdio] -DCCTYPE=GCC -DCCHOME=C:\mingw64 -Duselargefiles -Duselongdouble
        ../t/win32/stat.t (42)
          [stdio] -DCCTYPE=GCC -DCCHOME=C:\mingw64 -Duselargefiles -Uuseithreads
          [stdio] -DCCTYPE=GCC -DCCHOME=C:\mingw64 -Duselargefiles -Uuseithreads DEBUGGING
        
    Compiler messages:
        ..\locale.c: In function 'S_my_langinfo_i':
        ..\locale.c:6169:14: warning: '___lc_codepage_func' redeclared without dllimport attribute: previous dllimport ignored [-Wattributes]
        win32.c: In function 'win32_gets':
        win32.c:4696:12: warning: call to 'gets' declared with attribute warning: Using gets() is always unsafe - use fgets() instead [-Wattribute-warning]
        RealPPPort.xs: In function 'XS_Devel__PPPort_ptrtests':
        ..\..\lib\CORE/perl.h:2475:33: warning: cast from pointer to integer of different size [-Wpointer-to-int-cast]
        ..\..\lib\CORE/perl.h:2488:25: note: in expansion of macro 'INT2PTR'
        RealPPPort.xs:1831:27: note: in expansion of macro 'PTR2ul'
        POSIX.xs: In function 'fix_win32_tzenv':
        POSIX.xs:1725:13: warning: implicit declaration of function 'putenv'; did you mean '_putenv'? [-Wimplicit-function-declaration]
        DynaLoader.xs: In function 'XS_DynaLoader_dl_unload_file':
        dlutils.c:66:32: note: in definition of macro 'DLDEBUG'
        DynaLoader.xs:152:71: note: in expansion of macro 'PTR2ul'
        compress.c: In function 'sendMTFValues':
        compress.c:528:4: warning: 'nSelectors' may be used uninitialized [-Wmaybe-uninitialized]
        compress.c:248:10: note: 'nSelectors' was declared here
        perlhost.h: In function 'CPerlHost* IPerlMem2Host(IPerlMem*)':
        perlhost.h:227:63: warning: 'offsetof' within non-standard-layout type 'CPerlHost' is conditionally-supported [-Winvalid-offsetof]
        perlhost.h:241:12: note: in expansion of macro 'STRUCT2RAWPTR'
        perlhost.h: In function 'CPerlHost* IPerlMemShared2Host(IPerlMem*)':
        perlhost.h:246:12: note: in expansion of macro 'STRUCT2RAWPTR'
        perlhost.h: In function 'CPerlHost* IPerlMemParse2Host(IPerlMem*)':
        perlhost.h:251:12: note: in expansion of macro 'STRUCT2RAWPTR'
        perlhost.h: In function 'CPerlHost* IPerlEnv2Host(IPerlEnv*)':
        perlhost.h:234:38: note: in expansion of macro 'STRUCT2RAWPTR'
        perlhost.h:256:12: note: in expansion of macro 'STRUCT2PTR'
        perlhost.h: In function 'CPerlHost* IPerlStdIO2Host(IPerlStdIO*)':
        perlhost.h:261:12: note: in expansion of macro 'STRUCT2PTR'
        perlhost.h: In function 'CPerlHost* IPerlLIO2Host(IPerlLIO*)':
        perlhost.h:266:12: note: in expansion of macro 'STRUCT2PTR'
        perlhost.h: In function 'CPerlHost* IPerlDir2Host(IPerlDir*)':
        perlhost.h:271:12: note: in expansion of macro 'STRUCT2PTR'
        perlhost.h: In function 'CPerlHost* IPerlSock2Host(IPerlSock*)':
        perlhost.h:276:12: note: in expansion of macro 'STRUCT2PTR'
        perlhost.h: In function 'CPerlHost* IPerlProc2Host(IPerlProc*)':
        perlhost.h:281:12: note: in expansion of macro 'STRUCT2PTR'
        vdir.h:458:1: warning: function may return address of local variable [-Wreturn-local-addr]
        vdir.h:391:10: note: declared here
        vdir.h:689:1: warning: function may return address of local variable [-Wreturn-local-addr]
        vdir.h:623:11: note: declared here
        ..\sv.c: In function 'S_infnan_2pv':
        ..\perl.h:2659:34: warning: implicit declaration of function 'isnanl' [-Wimplicit-function-declaration]
        ..\sv.c:2820:14: note: in expansion of macro 'Perl_isnan'
        ..\pp_sys.c: In function 'Perl_pp_gmtime':
        ..\pp_sys.c:4888:31: note: in expansion of macro 'Perl_isnan'
        ..\numeric.c: In function 'S_my_atof_infnan':
        ..\numeric.c:1600:25: note: in expansion of macro 'Perl_isnan'
        RealPPPort.xs: In function 'XS_Devel__PPPort_croak_NVgf':
        RealPPPort.xs:979:34: warning: format '%Lg' expects argument of type 'double', but argument 3 has type 'NV' {aka 'long double'} [-Wformat=]
        POSIX.xs: In function 'my_fdim':
        ..\..\lib\CORE/perl.h:2659:34: warning: implicit declaration of function 'isnanl' [-Wimplicit-function-declaration]
        POSIX.xs:722:11: note: in expansion of macro 'Perl_isnan'
        RealPPPort.xs:979:34: warning: unknown conversion type character 'Q' in format [-Wformat=]
        RealPPPort.xs:979:34: warning: too many arguments for format [-Wformat-extra-args]
    

    About this smoke:
    smoking-perl: 5.32.1
    smoker-version: 1.80/0.046
    timestamp: 2023-09-12T21:03:09Z
    tester: abeltje
    
    For these MSWin32 builds -Duseithreads is always on (except for -Uuseithreads)