• Reports by commit
  • Recent reports
  • Perl5 CoreSmokeDB
  • Changes
  • Smoke v5.39.2-123-g7aab773a19 FAIL(F) darwin 22.6.0 (Mac OS X - macOS 13.5.2 (22G91)) MacBook Pro (0) [10 (8 performance and 2 efficiency) cores]

    Automated smoke report for branch blead 5.39.3 patch 7aab773a19c703d6ab3ff858455bc3a9ead7639b v5.39.2-123-g7aab773a19.
    idefix: MacBook Pro (0) (arm64/ [10 (8 performance and 2 efficiency) cores] cpus)
        on        darwin 22.6.0 (Mac OS X - macOS 13.5.2 (22G91))
        using     cc version Apple LLVM 14.0.3 (clang-1403.0.22.14.1) (*1)
        smoketime 4 hours 38 minutes (average 1 hour 9 minutes)
    
    Summary: FAIL(F)
    
    O = OK  F = Failure(s), extended report at the bottom
    X = Failure(s) under TEST but not under harness
    ? = still running or test results not (yet) available
    Build failures during:       - = unknown or N/A
    c = Configure, m = make, M = make (after miniperl), t = make test-prep
    
    v5.39.2-123-g7aab773a19
    ----------------------- ----------------------------------------------------
    F  O  O  F  O  O         (*1)
    F  F  F  F  F  F        -Duseithreads (*1)
    |  |  |  |  |  |
    |  |  |  |  |  +------  locale:nl_NL.UTF8 DEBUGGING
    |  |  |  |  +---------  perlio DEBUGGING
    |  |  |  +------------  stdio DEBUGGING
    |  |  +---------------  locale:nl_NL.UTF8
    |  +------------------  perlio
    +---------------------  stdio
    
      Applied patches:
        SMOKE7aab773a19c703d6ab3ff858455bc3a9ead7639b
    Skipped tests:
        None.
    
    Test failures:
      ../dist/SelfLoader/t/02SelfLoader-buggy.t (FAILED 1)
          [stdio]  DEBUGGING
          [stdio] -Duseithreads
          [stdio] -Duseithreads DEBUGGING
          [stdio] 
    
      ../dist/SelfLoader/t/01SelfLoader.t (FAILED Non-zero exit status: 22 Bad plan. You planned 20 tests but ran 0.)
          [stdio] 
          [stdio] -Duseithreads DEBUGGING
          [stdio]  DEBUGGING
          [stdio] -Duseithreads
    
      ../t/run/locale.t (FAILED 8-9 11-27 30-32 37-38)
          [stdio/perlio/locale:nl_NL.UTF8] -Duseithreads DEBUGGING
          [stdio/perlio/locale:nl_NL.UTF8] -Duseithreads
    
      ../dist/Devel-SelfStubber/t/Devel-SelfStubber.t (FAILED Non-zero exit status: 22 Bad plan. You planned 12 tests but ran 4.)
          [stdio] 
          [stdio] -Duseithreads DEBUGGING
          [stdio]  DEBUGGING
          [stdio] -Duseithreads
    
      ../ext/XS-APItest/t/locale.t (FAILED 9)
          [stdio/perlio/locale:nl_NL.UTF8] -Duseithreads
          [stdio/perlio/locale:nl_NL.UTF8] -Duseithreads DEBUGGING
    
      ../lib/locale.t (FAILED 427-428 432 435 449)
          [stdio/perlio/locale:nl_NL.UTF8] -Duseithreads
          [stdio/perlio/locale:nl_NL.UTF8] -Duseithreads DEBUGGING
    
    Compiler messages:
        regcomp_study.c:1162:9: warning: variable 'merged' set but not used [-Wunused-but-set-variable]
        regcomp_trie.c:655:13: warning: variable 'wordlen' set but not used [-Wunused-but-set-variable]
        Bzip2.xs:376:17: warning: variable 'flags' set but not used [-Wunused-but-set-variable]
        blocksort.c:765:11: warning: variable 'numQSorted' set but not used [-Wunused-but-set-variable]
        compress.c:247:30: warning: variable 'totc' set but not used [-Wunused-but-set-variable]
        Typemap.c:1775:6: warning: variable 'dummy' set but not used [-Wunused-but-set-variable]
        re_comp_trie.c:655:13: warning: variable 'wordlen' set but not used [-Wunused-but-set-variable]
    

    About this smoke:
    smoking-perl: 5.36.1
    smoker-version: 1.80/0.046
    timestamp: 2023-09-16T01:05:05Z
    tester: abeltje