• Reports by commit
  • Recent reports
  • Perl5 CoreSmokeDB
  • Changes
  • Smoke v5.39.4-68-g0fc8a78066 FAIL(F) darwin 23.1.0 (Mac OS X - macOS 14.1 (23B74)) MacBook Pro (0) [10 (8 performance and 2 efficiency) cores]

    Automated smoke report for branch blead 5.39.5 patch 0fc8a78066b687b6a94c809020b00827bef6e265 v5.39.4-68-g0fc8a78066.
    idefix: MacBook Pro (0) (arm64/ [10 (8 performance and 2 efficiency) cores] cpus)
        on        darwin 23.1.0 (Mac OS X - macOS 14.1 (23B74))
        using     cc version Apple LLVM 15.0.0 (clang-1500.0.40.1) (*1)
        smoketime 4 hours 41 minutes (average 1 hour 10 minutes)
    
    Summary: FAIL(F)
    
    O = OK  F = Failure(s), extended report at the bottom
    X = Failure(s) under TEST but not under harness
    ? = still running or test results not (yet) available
    Build failures during:       - = unknown or N/A
    c = Configure, m = make, M = make (after miniperl), t = make test-prep
    
    v5.39.4-68-g0fc8a78066
    ----------------------- ----------------------------------------------------
    F  O  O  F  O  O         (*1)
    F  O  O  F  O  O        -Duseithreads (*1)
    |  |  |  |  |  |
    |  |  |  |  |  +------  locale:nl_NL.UTF8 DEBUGGING
    |  |  |  |  +---------  perlio DEBUGGING
    |  |  |  +------------  stdio DEBUGGING
    |  |  +---------------  locale:nl_NL.UTF8
    |  +------------------  perlio
    +---------------------  stdio
    
      Applied patches:
        SMOKE0fc8a78066b687b6a94c809020b00827bef6e265
    Skipped tests:
        None.
    
    Test failures:
      ../dist/Devel-SelfStubber/t/Devel-SelfStubber.t (FAILED Non-zero exit status: 22 Bad plan. You planned 12 tests but ran 4.)
          [stdio] 
          [stdio] -Duseithreads
          [stdio]  DEBUGGING
          [stdio] -Duseithreads DEBUGGING
    
      ../dist/SelfLoader/t/02SelfLoader-buggy.t (FAILED 1)
          [stdio] -Duseithreads DEBUGGING
          [stdio] -Duseithreads
          [stdio] 
          [stdio]  DEBUGGING
    
      ../dist/SelfLoader/t/01SelfLoader.t (FAILED Non-zero exit status: 22 Bad plan. You planned 20 tests but ran 0.)
          [stdio] -Duseithreads
          [stdio] 
          [stdio]  DEBUGGING
          [stdio] -Duseithreads DEBUGGING
    
    Compiler messages:
        regcomp_study.c:1162:9: warning: variable 'merged' set but not used [-Wunused-but-set-variable]
        regcomp_trie.c:655:13: warning: variable 'wordlen' set but not used [-Wunused-but-set-variable]
        Bzip2.xs:376:17: warning: variable 'flags' set but not used [-Wunused-but-set-variable]
        blocksort.c:765:11: warning: variable 'numQSorted' set but not used [-Wunused-but-set-variable]
        compress.c:247:30: warning: variable 'totc' set but not used [-Wunused-but-set-variable]
        re_comp_trie.c:655:13: warning: variable 'wordlen' set but not used [-Wunused-but-set-variable]
    

    About this smoke:
    smoking-perl: 5.38.0
    smoker-version: 1.81/0.047
    timestamp: 2023-11-16T02:05:04Z
    tester: abeltje
    
    This is the new MacOS Sonoma.