• Reports by commit
  • Recent reports
  • Perl5 CoreSmokeDB
  • Changes
  • Smoke v5.39.8-17-g55492b2 FAIL(M) linux 6.7.5-1-default [openSUSE Tumbleweed 20240223] Intel(R) Core(TM) i7-6820HQ CPU @ 2.70GHz (GenuineIntel 3121MHz) 1[8 cores]

    Automated smoke report for branch blead 5.39.9 patch 55492b2735dc53511500d0ba96996c2a9fcbf178 v5.39.8-17-g55492b2.
    lx09: Intel(R) Core(TM) i7-6820HQ CPU @ 2.70GHz (GenuineIntel 3121MHz) (x86_64/1[8 cores] cpus)
        on        linux 6.7.5-1-default [openSUSE Tumbleweed 20240223]
        using     g++ version 13.2.1 20240206 [revision 67ac78caf31f7cb3202177e6428a46d829b70f23] (*1)
        smoketime 27 minutes 10 seconds (average 3 minutes 23.750 seconds)
    
    Summary: FAIL(M)
    
    O = OK  F = Failure(s), extended report at the bottom
    X = Failure(s) under TEST but not under harness
    ? = still running or test results not (yet) available
    Build failures during:       - = unknown or N/A
    c = Configure, m = make, M = make (after miniperl), t = make test-prep
    
    v5.39.8-17-g55492b2
    ----------------------- ----------------------------------------------------
    M  M                    -Dcc=g++ (*1)
    M  M                    -Dcc=g++ -Duse64bitall -Dusequadmath (*1)
    M  M                    -Dcc=g++ -Duseithreads (*1)
    M  M                    -Dcc=g++ -Duseithreads -Duse64bitall -Dusequadmath (*1)
    |  |
    |  +------------------  minitest DEBUGGING
    +---------------------  minitest
    
    Testsuite was run only with 'harness'
    
      Applied patches:
        SMOKE55492b2735dc53511500d0ba96996c2a9fcbf178
    Skipped tests:
        None.
    
    Test failures:
        None.
    
    Compiler messages:
        awk: cmd. line:1: warning: regexp escape sequence `\=' is not a known regexp operator
        deflate.c: In function ‘int Perl_crz_deflateCopy(z_streamp, z_streamp)’:
        deflate.c:1298:13: error: invalid conversion from ‘void*’ to ‘Perl_crz_Bytef*’ {aka ‘unsigned char*’} [-fpermissive]
        ./zlib-src/zutil.h:214:38: note:   initializing argument 1 of ‘void zmemcpy(Perl_crz_Bytef*, const Perl_crz_Bytef*, Perl_crz_uInt)’
        deflate.c:1298:27: error: invalid conversion from ‘void*’ to ‘const Perl_crz_Bytef*’ {aka ‘const unsigned char*’} [-fpermissive]
        ./zlib-src/zutil.h:214:57: note:   initializing argument 2 of ‘void zmemcpy(Perl_crz_Bytef*, const Perl_crz_Bytef*, Perl_crz_uInt)’
        deflate.c:1303:13: error: invalid conversion from ‘void*’ to ‘Perl_crz_Bytef*’ {aka ‘unsigned char*’} [-fpermissive]
        deflate.c:1303:25: error: invalid conversion from ‘void*’ to ‘const Perl_crz_Bytef*’ {aka ‘const unsigned char*’} [-fpermissive]
        deflate.c:1318:13: error: invalid conversion from ‘void*’ to ‘Perl_crz_Bytef*’ {aka ‘unsigned char*’} [-fpermissive]
        deflate.c:1318:31: error: invalid conversion from ‘void*’ to ‘const Perl_crz_Bytef*’ {aka ‘const unsigned char*’} [-fpermissive]
        deflate.c:1319:13: error: invalid conversion from ‘void*’ to ‘Perl_crz_Bytef*’ {aka ‘unsigned char*’} [-fpermissive]
        deflate.c:1319:31: error: invalid conversion from ‘void*’ to ‘const Perl_crz_Bytef*’ {aka ‘const unsigned char*’} [-fpermissive]
        MD5.xs: In function ‘MD5_CTX* get_md5_ctx(SV*)’:
        MD5.xs:464:34: warning: type qualifiers ignored on cast result type [-Wignored-qualifiers]
        MD5.xs: In function ‘SV* new_md5_ctx(MD5_CTX*, const char*)’:
        MD5.xs:486:47: warning: type qualifiers ignored on cast result type [-Wignored-qualifiers]
        ../../embed.h:700:78: note: in definition of macro ‘sv_magicext’
        def_t.c:7:32: warning: option ‘-Wc++-compat’ is valid for C/ObjC but not for C++ [-Wpragmas]
        byte_t.c:7:32: warning: option ‘-Wc++-compat’ is valid for C/ObjC but not for C++ [-Wpragmas]
        eu_01_t.c:7:32: warning: option ‘-Wc++-compat’ is valid for C/ObjC but not for C++ [-Wpragmas]
        gb_02_t.c:7:32: warning: option ‘-Wc++-compat’ is valid for C/ObjC but not for C++ [-Wpragmas]
        gb_03_t.c:7:32: warning: option ‘-Wc++-compat’ is valid for C/ObjC but not for C++ [-Wpragmas]
        ir_04_t.c:7:32: warning: option ‘-Wc++-compat’ is valid for C/ObjC but not for C++ [-Wpragmas]
        ma_05_t.c:7:32: warning: option ‘-Wc++-compat’ is valid for C/ObjC but not for C++ [-Wpragmas]
        cp_00_t.c:7:32: warning: option ‘-Wc++-compat’ is valid for C/ObjC but not for C++ [-Wpragmas]
        ebcdic_t.c:7:32: warning: option ‘-Wc++-compat’ is valid for C/ObjC but not for C++ [-Wpragmas]
        ji_02_t.c:7:32: warning: option ‘-Wc++-compat’ is valid for C/ObjC but not for C++ [-Wpragmas]
        ji_04_t.c:7:32: warning: option ‘-Wc++-compat’ is valid for C/ObjC but not for C++ [-Wpragmas]
        sh_06_t.c:7:32: warning: option ‘-Wc++-compat’ is valid for C/ObjC but not for C++ [-Wpragmas]
        ji_03_t.c:7:32: warning: option ‘-Wc++-compat’ is valid for C/ObjC but not for C++ [-Wpragmas]
        ma_04_t.c:7:32: warning: option ‘-Wc++-compat’ is valid for C/ObjC but not for C++ [-Wpragmas]
        ks_03_t.c:7:32: warning: option ‘-Wc++-compat’ is valid for C/ObjC but not for C++ [-Wpragmas]
        jo_02_t.c:7:32: warning: option ‘-Wc++-compat’ is valid for C/ObjC but not for C++ [-Wpragmas]
        symbol_t.c:7:32: warning: option ‘-Wc++-compat’ is valid for C/ObjC but not for C++ [-Wpragmas]
        cp_02_t.c:7:32: warning: option ‘-Wc++-compat’ is valid for C/ObjC but not for C++ [-Wpragmas]
        bi_01_t.c:7:32: warning: option ‘-Wc++-compat’ is valid for C/ObjC but not for C++ [-Wpragmas]
        bi_00_t.c:7:32: warning: option ‘-Wc++-compat’ is valid for C/ObjC but not for C++ [-Wpragmas]
        ma_03_t.c:7:32: warning: option ‘-Wc++-compat’ is valid for C/ObjC but not for C++ [-Wpragmas]
        locale.c: In function ‘const char* S_toggle_locale_i(locale_category_index, const char*, line_t)’:
        locale.c:4627:28: warning: ‘%s’ directive argument is null [-Wformat-overflow=]
        perl.h:4983:33: note: in definition of macro ‘DEBUG__’
        locale.c:4626:5: note: in expansion of macro ‘DEBUG_Lv’
        locale.c:4628:48: note: format string is defined here
        hv.c: In function ‘void Perl_hv_undef_flags(HV*, U32)’:
        hv.h:460:26: warning: array subscript [0, 9223372036854775807] is outside array bounds of ‘char [0]’ [-Warray-bounds=]
        embed.h:292:78: note: in definition of macro ‘hv_common’
        hv.h:474:34: note: in expansion of macro ‘HEK_FLAGS’
        hv.h:579:55: note: in expansion of macro ‘HEK_UTF8’
        hv.c:2268:19: note: in expansion of macro ‘hv_deletehek’
        MD5.xs: In function ‘MD5_CTX* get_md5_ctx(PerlInterpreter*, SV*)’:
        MD5.xs: In function ‘SV* new_md5_ctx(PerlInterpreter*, MD5_CTX*, const char*)’:
        hv.c: In function ‘void Perl_hv_undef_flags(PerlInterpreter*, HV*, U32)’:
    

    About this smoke:
    smoking-perl: 5.38.2
    smoker-version: 1.81/0.047
    timestamp: 2024-02-26T13:19:15Z
    tester: merijn
    
    Status overview available here: https://tux.nl/perl5/smoke/