• Reports by commit
  • Recent reports
  • Perl5 CoreSmokeDB
  • Changes
  • Smoke v5.39.8-71-g0e9cc8e5aa FAIL(F) darwin 23.2.0 (Mac OS X - macOS 14.2.1 (23C71)) MacBook Pro (0) [10 (8 performance and 2 efficiency) cores]

    Automated smoke report for branch blead 5.39.9 patch 0e9cc8e5aaebeef20004deb2c6fdf911e60ba482 v5.39.8-71-g0e9cc8e5aa.
    idefix: MacBook Pro (0) (arm64/ [10 (8 performance and 2 efficiency) cores] cpus)
        on        darwin 23.2.0 (Mac OS X - macOS 14.2.1 (23C71))
        using     cc version Apple LLVM 15.0.0 (clang-1500.1.0.2.5) (*1)
        smoketime 3 hours 25 minutes (average 51 minutes 20 seconds)
    
    Summary: FAIL(F)
    
    O = OK  F = Failure(s), extended report at the bottom
    X = Failure(s) under TEST but not under harness
    ? = still running or test results not (yet) available
    Build failures during:       - = unknown or N/A
    c = Configure, m = make, M = make (after miniperl), t = make test-prep
    
    v5.39.8-71-g0e9cc8e5aa
    ----------------------- ----------------------------------------------------
    F  O  O  F  O  O         (*1)
    F  O  O  F  O  O        -Duseithreads (*1)
    |  |  |  |  |  |
    |  |  |  |  |  +------  locale:nl_NL.UTF8 DEBUGGING
    |  |  |  |  +---------  perlio DEBUGGING
    |  |  |  +------------  stdio DEBUGGING
    |  |  +---------------  locale:nl_NL.UTF8
    |  +------------------  perlio
    +---------------------  stdio
    
      Applied patches:
        SMOKE0e9cc8e5aaebeef20004deb2c6fdf911e60ba482
    Skipped tests:
        None.
    
    Test failures:
      ../dist/SelfLoader/t/02SelfLoader-buggy.t (FAILED 1)
          [stdio] -Duseithreads
          [stdio]  DEBUGGING
          [stdio] 
          [stdio] -Duseithreads DEBUGGING
    
      ../dist/Devel-SelfStubber/t/Devel-SelfStubber.t (FAILED Non-zero exit status: 22 Bad plan. You planned 12 tests but ran 4.)
          [stdio]  DEBUGGING
          [stdio] 
          [stdio] -Duseithreads DEBUGGING
          [stdio] -Duseithreads
    
      ../dist/SelfLoader/t/01SelfLoader.t (FAILED Non-zero exit status: 22 Bad plan. You planned 20 tests but ran 0.)
          [stdio] -Duseithreads DEBUGGING
          [stdio]  DEBUGGING
          [stdio] 
          [stdio] -Duseithreads
    
    Compiler messages:
        regcomp_study.c:1067:9: warning: variable 'merged' set but not used [-Wunused-but-set-variable]
        regcomp_trie.c:655:13: warning: variable 'wordlen' set but not used [-Wunused-but-set-variable]
        Bzip2.xs:376:17: warning: variable 'flags' set but not used [-Wunused-but-set-variable]
        blocksort.c:765:11: warning: variable 'numQSorted' set but not used [-Wunused-but-set-variable]
        compress.c:247:30: warning: variable 'totc' set but not used [-Wunused-but-set-variable]
        re_comp_trie.c:655:13: warning: variable 'wordlen' set but not used [-Wunused-but-set-variable]
    

    About this smoke:
    smoking-perl: 5.38.2
    smoker-version: 1.81/0.047
    timestamp: 2024-03-15T02:05:03Z
    tester: abeltje
    
    This is the new MacOS Sonoma.