• Reports by commit
  • Recent reports
  • Perl5 CoreSmokeDB
  • Changes
  • Smoke v5.39.8-71-g0e9cc8e5aa PASS netbsd 9.3 Intel 686-class 1

    Automated smoke report for branch blead 5.39.9 patch 0e9cc8e5aaebeef20004deb2c6fdf911e60ba482 v5.39.8-71-g0e9cc8e5aa.
    cjg-netbsd9: Intel 686-class (amd64/1 cpus)
        on        netbsd 9.3
        using     clang version Clang 16.0.6 (*1)
        smoketime 3 hours 28 minutes (average 26 minutes 3 seconds)
    
    Summary: PASS
    
    O = OK  F = Failure(s), extended report at the bottom
    X = Failure(s) under TEST but not under harness
    ? = still running or test results not (yet) available
    Build failures during:       - = unknown or N/A
    c = Configure, m = make, M = make (after miniperl), t = make test-prep
    
    v5.39.8-71-g0e9cc8e5aa
    ----------------------- ----------------------------------------------------
    O  O                    -Dcc=clang -Accflags='-DPERL_RC_STACK -DDEBUG_LEAKING_SCALARS' (*1)
    O  O                    -Dcc=clang -Accflags='-DPERL_RC_STACK -DDEBUG_LEAKING_SCALARS' -Duse64bitall (*1)
    O  O                    -Dcc=clang -Accflags='-DPERL_RC_STACK -DDEBUG_LEAKING_SCALARS' -Duseithreads (*1)
    O  O                    -Dcc=clang -Accflags='-DPERL_RC_STACK -DDEBUG_LEAKING_SCALARS' -Duseithreads -Duse64bitall (*1)
    |  |
    |  +------------------  stdio DEBUGGING
    +---------------------  stdio
    
    Testsuite was run only with 'harness'
    
    Skipped tests:
            # One test name on a line
    
    Test failures:
        None.
    
        Test todo-passed:
        ../cpan/Time-Piece/t/06large.t (1-250)
          [stdio] -Dcc=clang -Accflags='-DPERL_RC_STACK -DDEBUG_LEAKING_SCALARS' -Duseithreads DEBUGGING
          [stdio] -Dcc=clang -Accflags='-DPERL_RC_STACK -DDEBUG_LEAKING_SCALARS' -Duse64bitall
          [stdio] -Dcc=clang -Accflags='-DPERL_RC_STACK -DDEBUG_LEAKING_SCALARS' -Duse64bitall DEBUGGING
          [stdio] -Dcc=clang -Accflags='-DPERL_RC_STACK -DDEBUG_LEAKING_SCALARS' DEBUGGING
          [stdio] -Dcc=clang -Accflags='-DPERL_RC_STACK -DDEBUG_LEAKING_SCALARS' -Duseithreads -Duse64bitall DEBUGGING
          [stdio] -Dcc=clang -Accflags='-DPERL_RC_STACK -DDEBUG_LEAKING_SCALARS' -Duseithreads
          [stdio] -Dcc=clang -Accflags='-DPERL_RC_STACK -DDEBUG_LEAKING_SCALARS' -Duseithreads -Duse64bitall
          [stdio] -Dcc=clang -Accflags='-DPERL_RC_STACK -DDEBUG_LEAKING_SCALARS'
        
    Compiler messages:
        ./sv_inline.h:75:28: warning: unused parameter 'file' [-Wunused-parameter]
        ./sv_inline.h:75:38: warning: unused parameter 'line' [-Wunused-parameter]
        ./sv_inline.h:75:56: warning: unused parameter 'func' [-Wunused-parameter]
        pp_hot.c:3163:21: warning: variable 'i' set but not used [-Wunused-but-set-variable]
        regcomp_study.c:1067:9: warning: variable 'merged' set but not used [-Wunused-but-set-variable]
        regcomp_trie.c:655:13: warning: variable 'wordlen' set but not used [-Wunused-but-set-variable]
        /usr/include/sys/cdefs_elf.h:67:5: error: function-like macro '__GNUC_PREREQ__' is not defined
        /usr/include/sys/cdefs_elf.h:73:5: error: function-like macro '__GNUC_PREREQ__' is not defined
        /usr/include/sys/cdefs_elf.h:79:5: error: function-like macro '__GNUC_PREREQ__' is not defined
        ../../sv_inline.h:75:28: warning: unused parameter 'file' [-Wunused-parameter]
        ../../sv_inline.h:75:38: warning: unused parameter 'line' [-Wunused-parameter]
        ../../sv_inline.h:75:56: warning: unused parameter 'func' [-Wunused-parameter]
        Bzip2.xs:376:17: warning: variable 'flags' set but not used [-Wunused-but-set-variable]
        blocksort.c:765:11: warning: variable 'numQSorted' set but not used [-Wunused-but-set-variable]
        compress.c:247:30: warning: variable 'totc' set but not used [-Wunused-but-set-variable]
        ../../../sv_inline.h:75:28: warning: unused parameter 'file' [-Wunused-parameter]
        ../../../sv_inline.h:75:38: warning: unused parameter 'line' [-Wunused-parameter]
        ../../../sv_inline.h:75:56: warning: unused parameter 'func' [-Wunused-parameter]
        Socket.c:1702:7: warning: variable 'interface' set but not used [-Wunused-but-set-variable]
        ./const-c.inc:351:42: warning: unused parameter 'iv_return' [-Wunused-parameter]
        re_comp_trie.c:655:13: warning: variable 'wordlen' set but not used [-Wunused-but-set-variable]
        ../../../../sv_inline.h:75:28: warning: unused parameter 'file' [-Wunused-parameter]
        ../../../../sv_inline.h:75:38: warning: unused parameter 'line' [-Wunused-parameter]
        ../../../../sv_inline.h:75:56: warning: unused parameter 'func' [-Wunused-parameter]
    

    About this smoke:
    smoking-perl: 5.38.2
    smoker-version: 1.71/0.046
    timestamp: 2024-03-16T16:26:19Z
    tester: core