• Reports by commit
  • Recent reports
  • Perl5 CoreSmokeDB
  • Changes
  • Smoke v5.39.8-76-g743293ba24 PASS netbsd 10.0_RC6 Intel 686-class 1

    Automated smoke report for branch blead 5.39.9 patch 743293ba242cb0021cda3c85364f93cc89c3ae3e v5.39.8-76-g743293ba24.
    cjg-netbsd10: Intel 686-class (amd64/1 cpus)
        on        netbsd 10.0_RC6
        using     gcc version 10.5.0 (*1)
        smoketime 3 hours 25 minutes (average 25 minutes 38 seconds)
    
    Summary: PASS
    
    O = OK  F = Failure(s), extended report at the bottom
    X = Failure(s) under TEST but not under harness
    ? = still running or test results not (yet) available
    Build failures during:       - = unknown or N/A
    c = Configure, m = make, M = make (after miniperl), t = make test-prep
    
    v5.39.8-76-g743293ba24
    ----------------------- ----------------------------------------------------
    O  O                    -Dcc=gcc -Accflags='-DPERL_RC_STACK -DDEBUG_LEAKING_SCALARS' (*1)
    O  O                    -Dcc=gcc -Accflags='-DPERL_RC_STACK -DDEBUG_LEAKING_SCALARS' -Duse64bitall (*1)
    O  O                    -Dcc=gcc -Accflags='-DPERL_RC_STACK -DDEBUG_LEAKING_SCALARS' -Duseithreads (*1)
    O  O                    -Dcc=gcc -Accflags='-DPERL_RC_STACK -DDEBUG_LEAKING_SCALARS' -Duseithreads -Duse64bitall (*1)
    |  |
    |  +------------------  stdio DEBUGGING
    +---------------------  stdio
    
    Testsuite was run only with 'harness'
    
    Skipped tests:
            # One test name on a line
    
    Test failures:
        None.
    
        Test todo-passed:
        ../cpan/Time-Piece/t/06large.t (1-250)
          [stdio] -Dcc=gcc -Accflags='-DPERL_RC_STACK -DDEBUG_LEAKING_SCALARS' -Duseithreads DEBUGGING
          [stdio] -Dcc=gcc -Accflags='-DPERL_RC_STACK -DDEBUG_LEAKING_SCALARS' -Duse64bitall DEBUGGING
          [stdio] -Dcc=gcc -Accflags='-DPERL_RC_STACK -DDEBUG_LEAKING_SCALARS' DEBUGGING
          [stdio] -Dcc=gcc -Accflags='-DPERL_RC_STACK -DDEBUG_LEAKING_SCALARS' -Duse64bitall
          [stdio] -Dcc=gcc -Accflags='-DPERL_RC_STACK -DDEBUG_LEAKING_SCALARS'
          [stdio] -Dcc=gcc -Accflags='-DPERL_RC_STACK -DDEBUG_LEAKING_SCALARS' -Duseithreads -Duse64bitall
          [stdio] -Dcc=gcc -Accflags='-DPERL_RC_STACK -DDEBUG_LEAKING_SCALARS' -Duseithreads
          [stdio] -Dcc=gcc -Accflags='-DPERL_RC_STACK -DDEBUG_LEAKING_SCALARS' -Duseithreads -Duse64bitall DEBUGGING
        
    Compiler messages:
        sv_inline.h: In function 'S_new_SV':
        sv_inline.h:75:28: warning: unused parameter 'file' [-Wunused-parameter]
        sv_inline.h:75:38: warning: unused parameter 'line' [-Wunused-parameter]
        sv_inline.h:75:56: warning: unused parameter 'func' [-Wunused-parameter]
        locale.c: In function 'S_parse_LC_ALL_string':
        locale.c:1478:11: warning: 'msg' may be used uninitialized in this function [-Wmaybe-uninitialized]
        /usr/include/sys/cdefs_elf.h:67:20: error: missing binary operator before token "("
        /usr/include/sys/cdefs_elf.h:73:20: error: missing binary operator before token "("
        /usr/include/sys/cdefs_elf.h:79:20: error: missing binary operator before token "("
        ../../sv_inline.h: In function 'S_new_SV':
        ../../sv_inline.h:75:28: warning: unused parameter 'file' [-Wunused-parameter]
        ../../sv_inline.h:75:38: warning: unused parameter 'line' [-Wunused-parameter]
        ../../sv_inline.h:75:56: warning: unused parameter 'func' [-Wunused-parameter]
        ../../../sv_inline.h: In function 'S_new_SV':
        ../../../sv_inline.h:75:28: warning: unused parameter 'file' [-Wunused-parameter]
        ../../../sv_inline.h:75:38: warning: unused parameter 'line' [-Wunused-parameter]
        ../../../sv_inline.h:75:56: warning: unused parameter 'func' [-Wunused-parameter]
        Socket.c: In function 'XS_Socket_pack_ip_mreq_source':
        Socket.c:1702:7: warning: variable 'interface' set but not used [-Wunused-but-set-variable]
        const-c.inc: In function 'constant_19':
        const-c.inc:351:42: warning: unused parameter 'iv_return' [-Wunused-parameter]
        ../../../../sv_inline.h: In function 'S_new_SV':
        ../../../../sv_inline.h:75:28: warning: unused parameter 'file' [-Wunused-parameter]
        ../../../../sv_inline.h:75:38: warning: unused parameter 'line' [-Wunused-parameter]
        ../../../../sv_inline.h:75:56: warning: unused parameter 'func' [-Wunused-parameter]
    

    About this smoke:
    smoking-perl: 5.38.2
    smoker-version: 1.71/0.046
    timestamp: 2024-03-20T00:50:30Z
    tester: core