• Reports by commit
  • Recent reports
  • Perl5 CoreSmokeDB
  • Changes
  • Smoke v5.39.8-74-g6a2327b FAIL(F) AIX 5.3.0.0/TL12-05 PPC_POWER5 1

    Automated smoke report for branch blead 5.39.9 patch 6a2327b68ffd1416197d594607479c827a5f4103 v5.39.8-74-g6a2327b.
    i3: PPC_POWER5 (ppc/1 cpus)
        on        AIX 5.3.0.0/TL12-05
        using     xlc -q32 version 12.1.0.12 (*1)
        using     xlc -q64 version 12.1.0.12 (*2)
        using     xlc_r -q32 version 12.1.0.12 (*3)
        using     xlc_r -q64 version 12.1.0.12 (*4)
        smoketime 1 day 59 minutes (average 3 hours 7 minutes)
    
    Summary: FAIL(F)
    
    O = OK  F = Failure(s), extended report at the bottom
    X = Failure(s) under TEST but not under harness
    ? = still running or test results not (yet) available
    Build failures during:       - = unknown or N/A
    c = Configure, m = make, M = make (after miniperl), t = make test-prep
    
    v5.39.8-74-g6a2327b
    ----------------------- ----------------------------------------------------
    F  O  F  F  F  F         (*1)
    F  O  F  F  O  F        -Duse64bitall (*2)
    F  O  F  F  F  F        -Duseithreads (*3)
    F  O  F  F  O  F        -Duseithreads -Duse64bitall (*4)
    |  |  |  |  |  |
    |  |  |  |  |  +------  locale:EN_US.UTF-8 DEBUGGING
    |  |  |  |  +---------  perlio DEBUGGING
    |  |  |  +------------  stdio DEBUGGING
    |  |  +---------------  locale:EN_US.UTF-8
    |  +------------------  perlio
    +---------------------  stdio
    
    Testsuite was run only with 'harness'
    
      Applied patches:
        SMOKE6a2327b68ffd1416197d594607479c827a5f4103
    Skipped tests:
        None.
    
    Test failures:
      ../t/porting/globvar.t (FAILED 1-4 6-75 77-141 143-177 179-211 213-228 230-406 408-424 426-432)
          [stdio/perlio/locale:EN_US.UTF-8]  DEBUGGING
    
      ../t/porting/globvar.t (FAILED 1-17 19-66 68-118 120-136 138-139)
          [stdio/perlio/locale:EN_US.UTF-8] -Duseithreads DEBUGGING
    
      ../t/io/open.t (FAILED 44 92)
          [stdio] 
          [stdio]  DEBUGGING
          [stdio] -Duseithreads
          [stdio] -Duse64bitall DEBUGGING
          [stdio] -Duseithreads DEBUGGING
          [stdio] -Duseithreads -Duse64bitall
          [stdio] -Duse64bitall
          [stdio] -Duseithreads -Duse64bitall DEBUGGING
    
      ../lib/warnings.t (FAILED 741)
          [locale:EN_US.UTF-8] -Duseithreads -Duse64bitall DEBUGGING
          [locale:EN_US.UTF-8] -Duse64bitall
          [locale:EN_US.UTF-8] -Duseithreads DEBUGGING
          [locale:EN_US.UTF-8] -Duseithreads -Duse64bitall
          [locale:EN_US.UTF-8] -Duse64bitall DEBUGGING
          [locale:EN_US.UTF-8] -Duseithreads
          [locale:EN_US.UTF-8]  DEBUGGING
          [locale:EN_US.UTF-8] 
    
    Compiler messages:
        "locale.c", line 5953.44: 1506-196 (W) Initialization between types "const _Bool" and "const char* const" is not allowed.
    

    About this smoke:
    smoking-perl: 5.38.0
    smoker-version: 1.81/0.047
    timestamp: 2024-03-19T23:20:45Z
    tester: merijn
    
    Status overview available here: https://tux.nl/perl5/smoke/