• Reports by commit
  • Recent reports
  • Perl5 CoreSmokeDB
  • Changes
  • Smoke v5.39.10-6-gd330c0a FAIL(F) AIX 5.3.0.0/TL12-05 PPC_POWER5 1

    Automated smoke report for branch blead 5.39.11 patch d330c0a0139a79c865d936c34c044c036bf8c6a9 v5.39.10-6-gd330c0a.
    i3: PPC_POWER5 (ppc/1 cpus)
        on        AIX 5.3.0.0/TL12-05
        using     xlc -q32 version 12.1.0.12 (*1)
        using     xlc -q64 version 12.1.0.12 (*2)
        using     xlc_r -q32 version 12.1.0.12 (*3)
        using     xlc_r -q64 version 12.1.0.12 (*4)
        smoketime 17 hours 21 minutes (average 2 hours 10 minutes)
    
    Summary: FAIL(F)
    
    O = OK  F = Failure(s), extended report at the bottom
    X = Failure(s) under TEST but not under harness
    ? = still running or test results not (yet) available
    Build failures during:       - = unknown or N/A
    c = Configure, m = make, M = make (after miniperl), t = make test-prep
    
    v5.39.10-6-gd330c0a
    ----------------------- ----------------------------------------------------
    O  F  F  F               (*1)
    O  F  O  F              -Duse64bitall (*2)
    O  F  F  F              -Duseithreads (*3)
    O  F  O  F              -Duseithreads -Duse64bitall (*4)
    |  |  |  |
    |  |  |  +------------  locale:EN_US.UTF-8 DEBUGGING
    |  |  +---------------  perlio DEBUGGING
    |  +------------------  locale:EN_US.UTF-8
    +---------------------  perlio
    
    Testsuite was run only with 'harness'
    
      Applied patches:
        SMOKEd330c0a0139a79c865d936c34c044c036bf8c6a9
    Skipped tests:
        None.
    
    Test failures:
      ../lib/warnings.t (FAILED 740)
          [locale:EN_US.UTF-8]  DEBUGGING
          [locale:EN_US.UTF-8] 
          [locale:EN_US.UTF-8] -Duseithreads -Duse64bitall
          [locale:EN_US.UTF-8] -Duseithreads DEBUGGING
          [locale:EN_US.UTF-8] -Duseithreads
          [locale:EN_US.UTF-8] -Duse64bitall
          [locale:EN_US.UTF-8] -Duse64bitall DEBUGGING
          [locale:EN_US.UTF-8] -Duseithreads -Duse64bitall DEBUGGING
    
      ../t/porting/globvar.t (FAILED 1-17 19-66 68-118 120-136 138-139)
          [perlio/locale:EN_US.UTF-8] -Duseithreads DEBUGGING
    
      ../t/porting/globvar.t (FAILED 1-4 6-75 77-141 143-177 179-211 213-228 230-406 408-424 426-432)
          [perlio/locale:EN_US.UTF-8]  DEBUGGING
    
    Compiler messages:
        "locale.c", line 5965.44: 1506-196 (W) Initialization between types "const _Bool" and "const char* const" is not allowed.
    

    About this smoke:
    smoking-perl: 5.38.0
    smoker-version: 1.82/0.047
    timestamp: 2024-04-30T14:42:45Z
    tester: merijn
    
    Status overview available here: https://tux.nl/perl5/smoke/