• Reports by commit
  • Recent reports
  • Perl5 CoreSmokeDB
  • Changes
  • Smoke v5.39.10-13-g20fe138296 PASS netbsd 9.4 Intel 686-class 1

    Automated smoke report for branch blead 5.39.11 patch 20fe1382965ae05938569abde22746b73012fdb6 v5.39.10-13-g20fe138296.
    cjg-netbsd9: Intel 686-class (amd64/1 cpus)
        on        netbsd 9.4
        using     g++ version 7.5.0 (*1)
        smoketime 3 hours 37 minutes (average 27 minutes 11 seconds)
    
    Summary: PASS
    
    O = OK  F = Failure(s), extended report at the bottom
    X = Failure(s) under TEST but not under harness
    ? = still running or test results not (yet) available
    Build failures during:       - = unknown or N/A
    c = Configure, m = make, M = make (after miniperl), t = make test-prep
    
    v5.39.10-13-g20fe138296
    ----------------------- ----------------------------------------------------
    O  O                    -Dcc=g++ -Accflags='-DPERL_RC_STACK -DDEBUG_LEAKING_SCALARS' (*1)
    O  O                    -Dcc=g++ -Accflags='-DPERL_RC_STACK -DDEBUG_LEAKING_SCALARS' -Duse64bitall (*1)
    O  O                    -Dcc=g++ -Accflags='-DPERL_RC_STACK -DDEBUG_LEAKING_SCALARS' -Duseithreads (*1)
    O  O                    -Dcc=g++ -Accflags='-DPERL_RC_STACK -DDEBUG_LEAKING_SCALARS' -Duseithreads -Duse64bitall (*1)
    |  |
    |  +------------------  stdio DEBUGGING
    +---------------------  stdio
    
    Testsuite was run only with 'harness'
    
    Skipped tests:
            # One test name on a line
    
    Test failures:
        None.
    
        Test todo-passed:
        ../cpan/Time-Piece/t/06large.t (1-250)
          [stdio] -Dcc=g++ -Accflags='-DPERL_RC_STACK -DDEBUG_LEAKING_SCALARS' -Duseithreads -Duse64bitall
          [stdio] -Dcc=g++ -Accflags='-DPERL_RC_STACK -DDEBUG_LEAKING_SCALARS' -Duseithreads -Duse64bitall DEBUGGING
          [stdio] -Dcc=g++ -Accflags='-DPERL_RC_STACK -DDEBUG_LEAKING_SCALARS' DEBUGGING
          [stdio] -Dcc=g++ -Accflags='-DPERL_RC_STACK -DDEBUG_LEAKING_SCALARS'
          [stdio] -Dcc=g++ -Accflags='-DPERL_RC_STACK -DDEBUG_LEAKING_SCALARS' -Duseithreads DEBUGGING
          [stdio] -Dcc=g++ -Accflags='-DPERL_RC_STACK -DDEBUG_LEAKING_SCALARS' -Duseithreads
          [stdio] -Dcc=g++ -Accflags='-DPERL_RC_STACK -DDEBUG_LEAKING_SCALARS' -Duse64bitall
          [stdio] -Dcc=g++ -Accflags='-DPERL_RC_STACK -DDEBUG_LEAKING_SCALARS' -Duse64bitall DEBUGGING
        
    Compiler messages:
        sv_inline.h: In function 'SV* S_new_SV(const char*, int, const char*)':
        sv_inline.h:75:28: warning: unused parameter 'file' [-Wunused-parameter]
        sv_inline.h:75:38: warning: unused parameter 'line' [-Wunused-parameter]
        sv_inline.h:75:56: warning: unused parameter 'func' [-Wunused-parameter]
        locale.c: In function 'parse_LC_ALL_string_return S_parse_LC_ALL_string(const char*, const char**, parse_LC_ALL_STRING_action, bool, bool, line_t)':
        locale.c:1473:20: warning: 'msg' may be used uninitialized in this function [-Wmaybe-uninitialized]
        /usr/include/sys/cdefs_elf.h:67:20: error: missing binary operator before token "("
        /usr/include/sys/cdefs_elf.h:73:20: error: missing binary operator before token "("
        /usr/include/sys/cdefs_elf.h:79:20: error: missing binary operator before token "("
        ../../sv_inline.h: In function 'SV* S_new_SV(const char*, int, const char*)':
        ../../sv_inline.h:75:28: warning: unused parameter 'file' [-Wunused-parameter]
        ../../sv_inline.h:75:38: warning: unused parameter 'line' [-Wunused-parameter]
        ../../sv_inline.h:75:56: warning: unused parameter 'func' [-Wunused-parameter]
        ../../../sv_inline.h: In function 'SV* S_new_SV(const char*, int, const char*)':
        ../../../sv_inline.h:75:28: warning: unused parameter 'file' [-Wunused-parameter]
        ../../../sv_inline.h:75:38: warning: unused parameter 'line' [-Wunused-parameter]
        ../../../sv_inline.h:75:56: warning: unused parameter 'func' [-Wunused-parameter]
        byte_t.c:7:32: warning: option '-Wc++-compat' is valid for C/ObjC but not for C++ [-Wpragmas]
        cp_00_t.c:7:32: warning: option '-Wc++-compat' is valid for C/ObjC but not for C++ [-Wpragmas]
        eu_01_t.c:7:32: warning: option '-Wc++-compat' is valid for C/ObjC but not for C++ [-Wpragmas]
        gb_02_t.c:7:32: warning: option '-Wc++-compat' is valid for C/ObjC but not for C++ [-Wpragmas]
        gb_03_t.c:7:32: warning: option '-Wc++-compat' is valid for C/ObjC but not for C++ [-Wpragmas]
        ir_04_t.c:7:32: warning: option '-Wc++-compat' is valid for C/ObjC but not for C++ [-Wpragmas]
        ma_05_t.c:7:32: warning: option '-Wc++-compat' is valid for C/ObjC but not for C++ [-Wpragmas]
        ebcdic_t.c:7:32: warning: option '-Wc++-compat' is valid for C/ObjC but not for C++ [-Wpragmas]
        ji_02_t.c:7:32: warning: option '-Wc++-compat' is valid for C/ObjC but not for C++ [-Wpragmas]
        ji_03_t.c:7:32: warning: option '-Wc++-compat' is valid for C/ObjC but not for C++ [-Wpragmas]
        ji_04_t.c:7:32: warning: option '-Wc++-compat' is valid for C/ObjC but not for C++ [-Wpragmas]
        sh_06_t.c:7:32: warning: option '-Wc++-compat' is valid for C/ObjC but not for C++ [-Wpragmas]
        jo_02_t.c:7:32: warning: option '-Wc++-compat' is valid for C/ObjC but not for C++ [-Wpragmas]
        ks_03_t.c:7:32: warning: option '-Wc++-compat' is valid for C/ObjC but not for C++ [-Wpragmas]
        ma_04_t.c:7:32: warning: option '-Wc++-compat' is valid for C/ObjC but not for C++ [-Wpragmas]
        symbol_t.c:7:32: warning: option '-Wc++-compat' is valid for C/ObjC but not for C++ [-Wpragmas]
        bi_00_t.c:7:32: warning: option '-Wc++-compat' is valid for C/ObjC but not for C++ [-Wpragmas]
        bi_01_t.c:7:32: warning: option '-Wc++-compat' is valid for C/ObjC but not for C++ [-Wpragmas]
        cp_02_t.c:7:32: warning: option '-Wc++-compat' is valid for C/ObjC but not for C++ [-Wpragmas]
        ma_03_t.c:7:32: warning: option '-Wc++-compat' is valid for C/ObjC but not for C++ [-Wpragmas]
        def_t.c:7:32: warning: option '-Wc++-compat' is valid for C/ObjC but not for C++ [-Wpragmas]
        Socket.xs: In function 'void XS_Socket_inet_aton(CV*)':
        Socket.xs:784:35: warning: missing initializer for member 'addrinfo::ai_family' [-Wmissing-field-initializers]
        Socket.xs:784:35: warning: missing initializer for member 'addrinfo::ai_socktype' [-Wmissing-field-initializers]
        Socket.xs:784:35: warning: missing initializer for member 'addrinfo::ai_protocol' [-Wmissing-field-initializers]
        Socket.xs:784:35: warning: missing initializer for member 'addrinfo::ai_addrlen' [-Wmissing-field-initializers]
        Socket.xs:784:35: warning: missing initializer for member 'addrinfo::ai_canonname' [-Wmissing-field-initializers]
        Socket.xs:784:35: warning: missing initializer for member 'addrinfo::ai_addr' [-Wmissing-field-initializers]
        Socket.xs:784:35: warning: missing initializer for member 'addrinfo::ai_next' [-Wmissing-field-initializers]
        Socket.c: In function 'void XS_Socket_pack_ip_mreq_source(CV*)':
        Socket.c:1702:7: warning: variable 'interface' set but not used [-Wunused-but-set-variable]
        const-c.inc: In function 'int constant_19(const char*, IV*)':
        const-c.inc:351:42: warning: unused parameter 'iv_return' [-Wunused-parameter]
        Piece.xs: In function 'char* _strptime(const char*, const char*, tm*, int*)':
        Piece.xs:712:8: warning: 'len' may be used uninitialized in this function [-Wmaybe-uninitialized]
        ../../../../sv_inline.h: In function 'SV* S_new_SV(const char*, int, const char*)':
        ../../../../sv_inline.h:75:28: warning: unused parameter 'file' [-Wunused-parameter]
        ../../../../sv_inline.h:75:38: warning: unused parameter 'line' [-Wunused-parameter]
        ../../../../sv_inline.h:75:56: warning: unused parameter 'func' [-Wunused-parameter]
        sv_inline.h: In function 'SV* S_new_SV(PerlInterpreter*, const char*, int, const char*)':
        locale.c: In function 'parse_LC_ALL_string_return S_parse_LC_ALL_string(PerlInterpreter*, const char*, const char**, parse_LC_ALL_STRING_action, bool, bool, line_t)':
        ../../sv_inline.h: In function 'SV* S_new_SV(PerlInterpreter*, const char*, int, const char*)':
        ../../../sv_inline.h: In function 'SV* S_new_SV(PerlInterpreter*, const char*, int, const char*)':
        Socket.xs: In function 'void XS_Socket_inet_aton(PerlInterpreter*, CV*)':
        Socket.c: In function 'void XS_Socket_pack_ip_mreq_source(PerlInterpreter*, CV*)':
        const-c.inc: In function 'int constant_19(PerlInterpreter*, const char*, IV*)':
        Piece.xs: In function 'char* _strptime(PerlInterpreter*, const char*, const char*, tm*, int*)':
        ../../../../sv_inline.h: In function 'SV* S_new_SV(PerlInterpreter*, const char*, int, const char*)':
    

    About this smoke:
    smoking-perl: 5.38.2
    smoker-version: 1.71/0.046
    timestamp: 2024-05-04T18:42:18Z
    tester: core