• Reports by commit
  • Recent reports
  • Perl5 CoreSmokeDB
  • Changes
  • Smoke v5.39.10-15-g1e43922428 FAIL(F) darwin 22.6.0 (Mac OS X - macOS 13.6.6 (22G630)) MacBook Pro (2,3 GHz) 1[2 cores]

    Automated smoke report for branch blead 5.39.11 patch 1e439224289df3172aedd2b1b72f98845bd1f89d v5.39.10-15-g1e43922428.
    lassie: MacBook Pro (2,3 GHz) (dual-core intel core i5/1[2 cores] cpus)
        on        darwin 22.6.0 (Mac OS X - macOS 13.6.6 (22G630))
        using     cc version Apple LLVM 15.0.0 (clang-1500.1.0.2.5) (*1)
        smoketime 1 day 16 hours 38 minutes (average 10 hours 9 minutes)
    
    Summary: FAIL(F)
    
    O = OK  F = Failure(s), extended report at the bottom
    X = Failure(s) under TEST but not under harness
    ? = still running or test results not (yet) available
    Build failures during:       - = unknown or N/A
    c = Configure, m = make, M = make (after miniperl), t = make test-prep
    
    v5.39.10-15-g1e43922428
    ----------------------- ----------------------------------------------------
    F  O  O  F  O  O         (*1)
    F  O  O  F  O  O        -Duseithreads (*1)
    |  |  |  |  |  |
    |  |  |  |  |  +------  locale:nl_NL.UTF-8 DEBUGGING
    |  |  |  |  +---------  perlio DEBUGGING
    |  |  |  +------------  stdio DEBUGGING
    |  |  +---------------  locale:nl_NL.UTF-8
    |  +------------------  perlio
    +---------------------  stdio
    
      Applied patches:
        SMOKE1e439224289df3172aedd2b1b72f98845bd1f89d
    Skipped tests:
            # One test name per line
    
    Test failures:
      ../dist/Devel-SelfStubber/t/Devel-SelfStubber.t (FAILED Non-zero exit status: 22 Bad plan. You planned 12 tests but ran 4.)
          [stdio] -Duseithreads
          [stdio] -Duseithreads DEBUGGING
          [stdio] 
          [stdio]  DEBUGGING
    
      ../dist/SelfLoader/t/01SelfLoader.t (FAILED Non-zero exit status: 22 Bad plan. You planned 20 tests but ran 0.)
          [stdio] -Duseithreads DEBUGGING
          [stdio] -Duseithreads
          [stdio]  DEBUGGING
          [stdio] 
    
      ../t/op/sleep.t (FAILED at test 2 )
          [stdio] 
    
      ../dist/SelfLoader/t/02SelfLoader-buggy.t (FAILED 1)
          [stdio] -Duseithreads DEBUGGING
          [stdio] -Duseithreads
          [stdio]  DEBUGGING
          [stdio] 
    
    Compiler messages:
        Bzip2.xs:376:17: warning: variable 'flags' set but not used [-Wunused-but-set-variable]
        blocksort.c:765:11: warning: variable 'numQSorted' set but not used [-Wunused-but-set-variable]
        compress.c:247:30: warning: variable 'totc' set but not used [-Wunused-but-set-variable]
    

    About this smoke:
    smoking-perl: 5.38.2
    smoker-version: 1.79_08/0.046
    timestamp: 2024-05-07T01:25:06Z
    tester: abeltje
    
    This is the new MacOS Ventura