• Reports by commit
  • Recent reports
  • Perl5 CoreSmokeDB
  • Changes
  • Smoke v5.40.0-RC1-1-gc729e47cb91 FAIL(F) linux 6.1.21-v8+ [Debian GNU/Linux 11.9] (100 MHz) 4

    Automated smoke report for branch blead 5.40.0 patch c729e47cb91f797fa10d8df6772de79066a941ac v5.40.0-RC1-1-gc729e47cb91.
    develpi64:  (100 MHz) (aarch64/4 cpus)
        on        linux 6.1.21-v8+ [Debian GNU/Linux 11.9]
        using     ccache gcc version 10.2.1 20210110 (*1)
        smoketime 2 hours 18 minutes (average 34 minutes 43 seconds)
    
    Summary: FAIL(F)
    
    O = OK  F = Failure(s), extended report at the bottom
    X = Failure(s) under TEST but not under harness
    ? = still running or test results not (yet) available
    Build failures during:       - = unknown or N/A
    c = Configure, m = make, M = make (after miniperl), t = make test-prep
    
    v5.40.0-RC1-1-gc729e47cb91
    ----------------------- ----------------------------------------------------
    O  O                    -Dcc="ccache gcc" (*1)
    O  F                    -Dcc="ccache gcc" -Duseithreads (*1)
    |  |
    |  +------------------  stdio DEBUGGING
    +---------------------  stdio
    
    Testsuite was run only with 'harness'
    
      Applied patches:
        RC1
    uncommitted-changes
    Skipped tests:
        None.
    
    Test failures:
      ../ext/XS-APItest/t/newDEFSVOP.t (FAILED Non-zero exit status: 255 Bad plan. You planned 7 tests but ran 0.)
          [stdio] -Dcc="ccache gcc" -Duseithreads DEBUGGING
    
      ../ext/XS-APItest/t/clone-with-stack.t (FAILED Non-zero exit status: 255 No plan found in TAP output)
          [stdio] -Dcc="ccache gcc" -Duseithreads DEBUGGING
    
      ../ext/XS-APItest/t/boolean.t (FAILED Non-zero exit status: 255 No plan found in TAP output)
          [stdio] -Dcc="ccache gcc" -Duseithreads DEBUGGING
    
      ../t/op/goto_xs.t (FAILED Non-zero exit status: 255 No plan found in TAP output)
          [stdio] -Dcc="ccache gcc" -Duseithreads DEBUGGING
    
      ../ext/XS-APItest/t/lvalue.t (FAILED Non-zero exit status: 255 Bad plan. You planned 4 tests but ran 0.)
          [stdio] -Dcc="ccache gcc" -Duseithreads DEBUGGING
    
      ../ext/XS-APItest/t/gv_fetchmethod_flags.t (FAILED 1 Non-zero exit status: 255 Bad plan. You planned 24 tests but ran 1.)
          [stdio] -Dcc="ccache gcc" -Duseithreads DEBUGGING
    
      ../ext/XS-APItest/t/stmtasexpr.t (FAILED 1-8 Non-zero exit status: 8)
          [stdio] -Dcc="ccache gcc" -Duseithreads DEBUGGING
    
      ../ext/XS-APItest/t/locale.t (FAILED Non-zero exit status: 255 No plan found in TAP output)
          [stdio] -Dcc="ccache gcc" -Duseithreads DEBUGGING
    
      ../ext/XS-APItest/t/utf8_warn08.t (FAILED 1 Non-zero exit status: 1 No plan found in TAP output)
          [stdio] -Dcc="ccache gcc" -Duseithreads DEBUGGING
    
      ../ext/XS-APItest/t/caller.t (FAILED Non-zero exit status: 255 No plan found in TAP output)
          [stdio] -Dcc="ccache gcc" -Duseithreads DEBUGGING
    
      ../ext/XS-APItest/t/op_contextualize.t (FAILED Non-zero exit status: 255 Bad plan. You planned 1 tests but ran 0.)
          [stdio] -Dcc="ccache gcc" -Duseithreads DEBUGGING
    
      ../ext/XS-APItest/t/handy03.t (FAILED No plan found in TAP output)
          [stdio] -Dcc="ccache gcc" -Duseithreads DEBUGGING
    
      ../ext/XS-APItest/t/keyword_multiline.t (FAILED Non-zero exit status: 255 Bad plan. You planned 4 tests but ran 0.)
          [stdio] -Dcc="ccache gcc" -Duseithreads DEBUGGING
    
      ../ext/XS-APItest/t/stuff_modify_bug.t (FAILED Non-zero exit status: 255 Bad plan. You planned 1 tests but ran 0.)
          [stdio] -Dcc="ccache gcc" -Duseithreads DEBUGGING
    
      ../t/op/goto.t (FAILED Non-zero exit status: 255 Bad plan. You planned 134 tests but ran 125.)
          [stdio] -Dcc="ccache gcc" -Duseithreads DEBUGGING
    
      ../ext/XS-APItest/t/hv_macro.t (FAILED 1 Non-zero exit status: 255 No plan found in TAP output)
          [stdio] -Dcc="ccache gcc" -Duseithreads DEBUGGING
    
      ../ext/XS-APItest/t/utf8_warn07.t (FAILED 1 Non-zero exit status: 1 No plan found in TAP output)
          [stdio] -Dcc="ccache gcc" -Duseithreads DEBUGGING
    
      ../ext/XS-APItest/t/arrayexpr.t (FAILED 1-13 Non-zero exit status: 17)
          [stdio] -Dcc="ccache gcc" -Duseithreads DEBUGGING
    
      ../ext/XS-APItest/t/swaplabel.t (FAILED 1-12 Non-zero exit status: 48)
          [stdio] -Dcc="ccache gcc" -Duseithreads DEBUGGING
    
      ../ext/XS-APItest/t/copstash.t (FAILED Non-zero exit status: 255 No plan found in TAP output)
          [stdio] -Dcc="ccache gcc" -Duseithreads DEBUGGING
    
      ../t/porting/podcheck.t (FAILED 207)
          [stdio] -Dcc="ccache gcc" -Duseithreads DEBUGGING
    
      ../ext/XS-APItest/t/cleanup.t (FAILED Non-zero exit status: 255 Bad plan. You planned 3 tests but ran 0.)
          [stdio] -Dcc="ccache gcc" -Duseithreads DEBUGGING
    
      ../ext/XS-APItest/t/magic.t (FAILED Non-zero exit status: 255 No plan found in TAP output)
          [stdio] -Dcc="ccache gcc" -Duseithreads DEBUGGING
    
      ../ext/XS-APItest/t/utf8_warn05.t (FAILED 1 Non-zero exit status: 1 No plan found in TAP output)
          [stdio] -Dcc="ccache gcc" -Duseithreads DEBUGGING
    
      ../ext/XS-APItest/t/utf8_warn06.t (FAILED 1 Non-zero exit status: 1 No plan found in TAP output)
          [stdio] -Dcc="ccache gcc" -Duseithreads DEBUGGING
    
      ../ext/XS-APItest/t/load-module.t (FAILED Non-zero exit status: 255 No plan found in TAP output)
          [stdio] -Dcc="ccache gcc" -Duseithreads DEBUGGING
    
      ../ext/XS-APItest/t/temp_lv_sub.t (FAILED 1-5 Non-zero exit status: 5)
          [stdio] -Dcc="ccache gcc" -Duseithreads DEBUGGING
    
      ../ext/XS-APItest/t/xs_special_subs_require.t (FAILED 71 Non-zero exit status: 255 Bad plan. You planned 103 tests but ran 90.)
          [stdio] -Dcc="ccache gcc" -Duseithreads DEBUGGING
    
      ../ext/XS-APItest/t/handy09.t (FAILED No plan found in TAP output)
          [stdio] -Dcc="ccache gcc" -Duseithreads DEBUGGING
    
      ../ext/XS-APItest/t/boolean-thr.t (FAILED Non-zero exit status: 255 No plan found in TAP output)
          [stdio] -Dcc="ccache gcc" -Duseithreads DEBUGGING
    
      ../ext/XS-APItest/t/my_exit.t (FAILED Non-zero exit status: 255 No plan found in TAP output)
          [stdio] -Dcc="ccache gcc" -Duseithreads DEBUGGING
    
      ../ext/XS-APItest/t/sv_numeq.t (FAILED Non-zero exit status: 255 Bad plan. You planned 9 tests but ran 0.)
          [stdio] -Dcc="ccache gcc" -Duseithreads DEBUGGING
    
      ../ext/XS-APItest/t/sort.t (FAILED Non-zero exit status: 255 Bad plan. You planned 2 tests but ran 0.)
          [stdio] -Dcc="ccache gcc" -Duseithreads DEBUGGING
    
      ../ext/XS-APItest/t/whichsig.t (FAILED 1 Non-zero exit status: 255 Bad plan. You planned 9 tests but ran 1.)
          [stdio] -Dcc="ccache gcc" -Duseithreads DEBUGGING
    
      ../ext/XS-APItest/t/handy01.t (FAILED No plan found in TAP output)
          [stdio] -Dcc="ccache gcc" -Duseithreads DEBUGGING
    
      ../ext/XS-APItest/t/copyhints.t (FAILED Non-zero exit status: 255 Bad plan. You planned 1 tests but ran 0.)
          [stdio] -Dcc="ccache gcc" -Duseithreads DEBUGGING
    
      ../ext/XS-APItest/t/weaken.t (FAILED 1 Non-zero exit status: 255 Bad plan. You planned 7 tests but ran 1.)
          [stdio] -Dcc="ccache gcc" -Duseithreads DEBUGGING
    
      ../ext/XS-APItest/t/delimcpy.t (FAILED Non-zero exit status: 255 No plan found in TAP output)
          [stdio] -Dcc="ccache gcc" -Duseithreads DEBUGGING
    
      ../ext/XS-APItest/t/stuff_svcur_bug.t (FAILED Non-zero exit status: 255 Bad plan. You planned 1 tests but ran 0.)
          [stdio] -Dcc="ccache gcc" -Duseithreads DEBUGGING
    
      ../ext/XS-APItest/t/savehints.t (FAILED Non-zero exit status: 255 Bad plan. You planned 1 tests but ran 0.)
          [stdio] -Dcc="ccache gcc" -Duseithreads DEBUGGING
    
      ../ext/XS-APItest/t/svsetsv.t (FAILED 1 Non-zero exit status: 255 Bad plan. You planned 7 tests but ran 1.)
          [stdio] -Dcc="ccache gcc" -Duseithreads DEBUGGING
    
      ../ext/XS-APItest/t/svcat.t (FAILED Non-zero exit status: 255 Bad plan. You planned 4 tests but ran 0.)
          [stdio] -Dcc="ccache gcc" -Duseithreads DEBUGGING
    
      ../ext/XS-APItest/t/blockasexpr.t (FAILED 1-16 Non-zero exit status: 16)
          [stdio] -Dcc="ccache gcc" -Duseithreads DEBUGGING
    
      ../ext/XS-APItest/t/multicall.t (FAILED Non-zero exit status: 255 Bad plan. You planned 80 tests but ran 0.)
          [stdio] -Dcc="ccache gcc" -Duseithreads DEBUGGING
    
      ../ext/XS-APItest/t/extend.t (FAILED Non-zero exit status: 255 No plan found in TAP output)
          [stdio] -Dcc="ccache gcc" -Duseithreads DEBUGGING
    
      ../ext/XS-APItest/t/utf8_warn00.t (FAILED 1 Non-zero exit status: 1 No plan found in TAP output)
          [stdio] -Dcc="ccache gcc" -Duseithreads DEBUGGING
    
      ../ext/XS-APItest/t/mro.t (FAILED Non-zero exit status: 255 No plan found in TAP output)
          [stdio] -Dcc="ccache gcc" -Duseithreads DEBUGGING
    
      ../ext/XS-APItest/t/xsppwrap.t (FAILED Non-zero exit status: 255 No plan found in TAP output)
          [stdio] -Dcc="ccache gcc" -Duseithreads DEBUGGING
    
      ../ext/XS-APItest/t/savestack.t (FAILED Non-zero exit status: 255 No plan found in TAP output)
          [stdio] -Dcc="ccache gcc" -Duseithreads DEBUGGING
    
      ../ext/XS-APItest/t/ptr_table.t (FAILED Non-zero exit status: 255 No plan found in TAP output)
          [stdio] -Dcc="ccache gcc" -Duseithreads DEBUGGING
    
      ../ext/XS-APItest/t/underscore_length.t (FAILED Non-zero exit status: 255 Bad plan. You planned 2 tests but ran 0.)
          [stdio] -Dcc="ccache gcc" -Duseithreads DEBUGGING
    
      ../ext/XS-APItest/t/svpv_magic.t (FAILED 1 Non-zero exit status: 255 Bad plan. You planned 10 tests but ran 1.)
          [stdio] -Dcc="ccache gcc" -Duseithreads DEBUGGING
    
      ../ext/XS-APItest/t/pmflag.t (FAILED 2 Non-zero exit status: 1)
          [stdio] -Dcc="ccache gcc" -Duseithreads DEBUGGING
    
      ../ext/XS-APItest/t/handy08.t (FAILED No plan found in TAP output)
          [stdio] -Dcc="ccache gcc" -Duseithreads DEBUGGING
    
      ../ext/XS-APItest/t/utf8_warn09.t (FAILED 1 Non-zero exit status: 1 No plan found in TAP output)
          [stdio] -Dcc="ccache gcc" -Duseithreads DEBUGGING
    
      ../ext/XS-APItest/t/utf8_warn03.t (FAILED 1 Non-zero exit status: 1 No plan found in TAP output)
          [stdio] -Dcc="ccache gcc" -Duseithreads DEBUGGING
    
      ../ext/XS-APItest/t/svpv.t (FAILED Non-zero exit status: 255 Bad plan. You planned 43 tests but ran 0.)
          [stdio] -Dcc="ccache gcc" -Duseithreads DEBUGGING
    
      ../ext/XS-APItest/t/push.t (FAILED 1 Non-zero exit status: 255 Bad plan. You planned 9 tests but ran 1.)
          [stdio] -Dcc="ccache gcc" -Duseithreads DEBUGGING
    
      ../ext/XS-APItest/t/sviscow.t (FAILED Non-zero exit status: 255 Bad plan. You planned 1 tests but ran 0.)
          [stdio] -Dcc="ccache gcc" -Duseithreads DEBUGGING
    
      ../ext/XS-APItest/t/subcall.t (FAILED Non-zero exit status: 255 Bad plan. You planned 1 tests but ran 0.)
          [stdio] -Dcc="ccache gcc" -Duseithreads DEBUGGING
    
      ../ext/XS-APItest/t/overload.t (FAILED 1 Non-zero exit status: 255 No plan found in TAP output)
          [stdio] -Dcc="ccache gcc" -Duseithreads DEBUGGING
    
      ../ext/XS-APItest/t/xsub_h.t (FAILED 1 Non-zero exit status: 255 No plan found in TAP output)
          [stdio] -Dcc="ccache gcc" -Duseithreads DEBUGGING
    
      ../ext/XS-APItest/t/handy02.t (FAILED No plan found in TAP output)
          [stdio] -Dcc="ccache gcc" -Duseithreads DEBUGGING
    
      ../ext/XS-APItest/t/stmtsasexpr.t (FAILED 1-10 Non-zero exit status: 10)
          [stdio] -Dcc="ccache gcc" -Duseithreads DEBUGGING
    
      ../ext/XS-APItest/t/loopblock.t (FAILED 1-4 Non-zero exit status: 10)
          [stdio] -Dcc="ccache gcc" -Duseithreads DEBUGGING
    
      ../ext/XS-APItest/t/gv_fetchmeth.t (FAILED 1 Non-zero exit status: 255 Bad plan. You planned 44 tests but ran 1.)
          [stdio] -Dcc="ccache gcc" -Duseithreads DEBUGGING
    
      ../ext/XS-APItest/t/printf.t (FAILED 1 Non-zero exit status: 255 Bad plan. You planned 13 tests but ran 1.)
          [stdio] -Dcc="ccache gcc" -Duseithreads DEBUGGING
    
      ../ext/XS-APItest/t/keyword_plugin.t (FAILED 2-9 Non-zero exit status: 10)
          [stdio] -Dcc="ccache gcc" -Duseithreads DEBUGGING
    
      ../ext/XS-APItest/t/utf8_to_bytes.t (FAILED 1 Non-zero exit status: 255 No plan found in TAP output)
          [stdio] -Dcc="ccache gcc" -Duseithreads DEBUGGING
    
      ../ext/XS-APItest/t/eval-filter.t (FAILED Non-zero exit status: 255 Bad plan. You planned 5 tests but ran 0.)
          [stdio] -Dcc="ccache gcc" -Duseithreads DEBUGGING
    
      ../ext/XS-APItest/t/rv2cv_op_cv.t (FAILED Non-zero exit status: 255 Bad plan. You planned 1 tests but ran 0.)
          [stdio] -Dcc="ccache gcc" -Duseithreads DEBUGGING
    
      ../ext/XS-APItest/t/svcatpvf.t (FAILED Non-zero exit status: 255 Bad plan. You planned 6 tests but ran 0.)
          [stdio] -Dcc="ccache gcc" -Duseithreads DEBUGGING
    
      ../ext/XS-APItest/t/pad_scalar.t (FAILED Non-zero exit status: 255 Bad plan. You planned 76 tests but ran 0.)
          [stdio] -Dcc="ccache gcc" -Duseithreads DEBUGGING
    
      ../ext/XS-APItest/t/lexsub.t (FAILED Non-zero exit status: 255 Bad plan. You planned 5 tests but ran 0.)
          [stdio] -Dcc="ccache gcc" -Duseithreads DEBUGGING
    
      ../ext/XS-APItest/t/autoload.t (FAILED Non-zero exit status: 255 Bad plan. You planned 26 tests but ran 0.)
          [stdio] -Dcc="ccache gcc" -Duseithreads DEBUGGING
    
      ../ext/XS-APItest/t/synthetic_scope.t (FAILED Non-zero exit status: 255 Bad plan. You planned 18 tests but ran 0.)
          [stdio] -Dcc="ccache gcc" -Duseithreads DEBUGGING
    
      ../ext/XS-APItest/t/bootstrap.t (FAILED Non-zero exit status: 255 No plan found in TAP output)
          [stdio] -Dcc="ccache gcc" -Duseithreads DEBUGGING
    
      ../ext/XS-APItest/t/sv_streq.t (FAILED Non-zero exit status: 255 Bad plan. You planned 9 tests but ran 0.)
          [stdio] -Dcc="ccache gcc" -Duseithreads DEBUGGING
    
      ../ext/XS-APItest/t/swaptwostmts.t (FAILED 2-13 Non-zero exit status: 30)
          [stdio] -Dcc="ccache gcc" -Duseithreads DEBUGGING
    
      ../ext/XS-APItest/t/peep.t (FAILED Non-zero exit status: 255 Bad plan. You planned 6 tests but ran 0.)
          [stdio] -Dcc="ccache gcc" -Duseithreads DEBUGGING
    
      ../ext/XS-APItest/t/newAV.t (FAILED Non-zero exit status: 255 No plan found in TAP output)
          [stdio] -Dcc="ccache gcc" -Duseithreads DEBUGGING
    
      ../ext/XS-APItest/t/cv_refcounted_anysv.t (FAILED Non-zero exit status: 255 No plan found in TAP output)
          [stdio] -Dcc="ccache gcc" -Duseithreads DEBUGGING
    
      ../ext/XS-APItest/t/exception.t (FAILED 1-6 Non-zero exit status: 9)
          [stdio] -Dcc="ccache gcc" -Duseithreads DEBUGGING
    
      ../ext/XS-APItest/t/op_list.t (FAILED Non-zero exit status: 255 Bad plan. You planned 2 tests but ran 0.)
          [stdio] -Dcc="ccache gcc" -Duseithreads DEBUGGING
    
      ../ext/XS-APItest/t/hash.t (FAILED 1 Non-zero exit status: 255 No plan found in TAP output)
          [stdio] -Dcc="ccache gcc" -Duseithreads DEBUGGING
    
      ../ext/XS-APItest/t/customop.t (FAILED Non-zero exit status: 255 Bad plan. You planned 25 tests but ran 0.)
          [stdio] -Dcc="ccache gcc" -Duseithreads DEBUGGING
    
      ../ext/XS-APItest/t/grok.t (FAILED Non-zero exit status: 255 No plan found in TAP output)
          [stdio] -Dcc="ccache gcc" -Duseithreads DEBUGGING
    
      ../ext/XS-APItest/t/postinc.t (FAILED 1-2 Non-zero exit status: 6)
          [stdio] -Dcc="ccache gcc" -Duseithreads DEBUGGING
    
      ../ext/XS-APItest/t/utf8_warn04.t (FAILED 1 Non-zero exit status: 1 No plan found in TAP output)
          [stdio] -Dcc="ccache gcc" -Duseithreads DEBUGGING
    
      ../ext/XS-APItest/t/subsignature.t (FAILED 1-2 Non-zero exit status: 2)
          [stdio] -Dcc="ccache gcc" -Duseithreads DEBUGGING
    
      ../ext/XS-APItest/t/handy07.t (FAILED No plan found in TAP output)
          [stdio] -Dcc="ccache gcc" -Duseithreads DEBUGGING
    
      ../ext/XS-APItest/t/handy04.t (FAILED No plan found in TAP output)
          [stdio] -Dcc="ccache gcc" -Duseithreads DEBUGGING
    
      ../ext/XS-APItest/t/callregexec.t (FAILED Non-zero exit status: 255 No plan found in TAP output)
          [stdio] -Dcc="ccache gcc" -Duseithreads DEBUGGING
    
      ../ext/XS-APItest/t/scopelessblock.t (FAILED 1-10 Non-zero exit status: 14)
          [stdio] -Dcc="ccache gcc" -Duseithreads DEBUGGING
    
      ../ext/XS-APItest/t/gv_autoload4.t (FAILED 1 Non-zero exit status: 255 Bad plan. You planned 31 tests but ran 1.)
          [stdio] -Dcc="ccache gcc" -Duseithreads DEBUGGING
    
      ../ext/XS-APItest/t/mortal_destructor.t (FAILED Non-zero exit status: 255 No plan found in TAP output)
          [stdio] -Dcc="ccache gcc" -Duseithreads DEBUGGING
    
      ../ext/XS-APItest/t/utf8.t (FAILED 1 Non-zero exit status: 255 No plan found in TAP output)
          [stdio] -Dcc="ccache gcc" -Duseithreads DEBUGGING
    
      ../ext/XS-APItest/t/call_checker.t (FAILED Non-zero exit status: 255 Bad plan. You planned 78 tests but ran 0.)
          [stdio] -Dcc="ccache gcc" -Duseithreads DEBUGGING
    
      ../ext/XS-APItest/t/gv_fetchmeth_autoload.t (FAILED 1 Non-zero exit status: 255 Bad plan. You planned 53 tests but ran 1.)
          [stdio] -Dcc="ccache gcc" -Duseithreads DEBUGGING
    
      ../ext/XS-APItest/t/keyword_plugin_threads.t (FAILED 1)
          [stdio] -Dcc="ccache gcc" -Duseithreads DEBUGGING
    
      ../ext/XS-APItest/t/handy06.t (FAILED No plan found in TAP output)
          [stdio] -Dcc="ccache gcc" -Duseithreads DEBUGGING
    
      ../ext/XS-APItest/t/newCONSTSUB.t (FAILED Non-zero exit status: 255 Bad plan. You planned 22 tests but ran 0.)
          [stdio] -Dcc="ccache gcc" -Duseithreads DEBUGGING
    
      ../ext/XS-APItest/t/get.t (FAILED Non-zero exit status: 255 Bad plan. You planned 5 tests but ran 0.)
          [stdio] -Dcc="ccache gcc" -Duseithreads DEBUGGING
    
      ../ext/XS-APItest/t/win32.t (FAILED Non-zero exit status: 255 No plan found in TAP output)
          [stdio] -Dcc="ccache gcc" -Duseithreads DEBUGGING
    
      ../ext/XS-APItest/t/utf16_to_utf8.t (FAILED Non-zero exit status: 255 No plan found in TAP output)
          [stdio] -Dcc="ccache gcc" -Duseithreads DEBUGGING
    
      ../ext/XS-APItest/t/utf8_warn02.t (FAILED 1 Non-zero exit status: 1 No plan found in TAP output)
          [stdio] -Dcc="ccache gcc" -Duseithreads DEBUGGING
    
      ../ext/XS-APItest/t/fetch_pad_names.t (FAILED Non-zero exit status: 255 No plan found in TAP output)
          [stdio] -Dcc="ccache gcc" -Duseithreads DEBUGGING
    
      ../ext/XS-APItest/t/xs_special_subs.t (FAILED 11 Non-zero exit status: 255 Bad plan. You planned 100 tests but ran 30.)
          [stdio] -Dcc="ccache gcc" -Duseithreads DEBUGGING
    
      ../ext/XS-APItest/t/gotosub.t (FAILED Non-zero exit status: 255 Bad plan. You planned 1 tests but ran 0.)
          [stdio] -Dcc="ccache gcc" -Duseithreads DEBUGGING
    
      ../ext/XS-APItest/t/rpp_invoke_xs.t (FAILED Non-zero exit status: 255 No plan found in TAP output)
          [stdio] -Dcc="ccache gcc" -Duseithreads DEBUGGING
    
      ../ext/XS-APItest/t/refs.t (FAILED 1 Non-zero exit status: 255 Bad plan. You planned 9 tests but ran 1.)
          [stdio] -Dcc="ccache gcc" -Duseithreads DEBUGGING
    
      ../ext/XS-APItest/t/addissub.t (FAILED Non-zero exit status: 255 Bad plan. You planned 9 tests but ran 0.)
          [stdio] -Dcc="ccache gcc" -Duseithreads DEBUGGING
    
      ../ext/XS-APItest/t/my_strtod.t (FAILED Non-zero exit status: 255 No plan found in TAP output)
          [stdio] -Dcc="ccache gcc" -Duseithreads DEBUGGING
    
      ../ext/XS-APItest/t/utf8_warn01.t (FAILED 1 Non-zero exit status: 1 No plan found in TAP output)
          [stdio] -Dcc="ccache gcc" -Duseithreads DEBUGGING
    
      ../ext/XS-APItest/t/call.t (FAILED 1 Non-zero exit status: 255 Bad plan. You planned 542 tests but ran 1.)
          [stdio] -Dcc="ccache gcc" -Duseithreads DEBUGGING
    
      ../ext/XS-APItest/t/handy05.t (FAILED No plan found in TAP output)
          [stdio] -Dcc="ccache gcc" -Duseithreads DEBUGGING
    
      ../ext/XS-APItest/t/join_with_space.t (FAILED Non-zero exit status: 255 Bad plan. You planned 1 tests but ran 0.)
          [stdio] -Dcc="ccache gcc" -Duseithreads DEBUGGING
    
      ../ext/XS-APItest/t/looprest.t (FAILED 1-4 Non-zero exit status: 10)
          [stdio] -Dcc="ccache gcc" -Duseithreads DEBUGGING
    
      ../ext/XS-APItest/t/svpeek.t (FAILED 1 Non-zero exit status: 255 Bad plan. You planned 52 tests but ran 1.)
          [stdio] -Dcc="ccache gcc" -Duseithreads DEBUGGING
    
      ../ext/XS-APItest/t/gv_const_sv.t (FAILED Non-zero exit status: 255 Bad plan. You planned 6 tests but ran 0.)
          [stdio] -Dcc="ccache gcc" -Duseithreads DEBUGGING
    
      ../ext/XS-APItest/t/magic_chain.t (FAILED Non-zero exit status: 255 Bad plan. You planned 1 tests but ran 0.)
          [stdio] -Dcc="ccache gcc" -Duseithreads DEBUGGING
    
      ../ext/XS-APItest/t/cv_name.t (FAILED Non-zero exit status: 255 No plan found in TAP output)
          [stdio] -Dcc="ccache gcc" -Duseithreads DEBUGGING
    
      ../ext/XS-APItest/t/cophh.t (FAILED Non-zero exit status: 255 Bad plan. You planned 2 tests but ran 0.)
          [stdio] -Dcc="ccache gcc" -Duseithreads DEBUGGING
    
      ../ext/XS-APItest/t/labelconst.t (FAILED 1-10 Non-zero exit status: 24)
          [stdio] -Dcc="ccache gcc" -Duseithreads DEBUGGING
    
      ../ext/XS-APItest/t/blockhooks.t (FAILED Non-zero exit status: 255 Bad plan. You planned 17 tests but ran 0.)
          [stdio] -Dcc="ccache gcc" -Duseithreads DEBUGGING
    
      ../ext/XS-APItest/t/gv_init.t (FAILED Non-zero exit status: 255 Bad plan. You planned 12 tests but ran 0.)
          [stdio] -Dcc="ccache gcc" -Duseithreads DEBUGGING
    
      ../ext/XS-APItest/t/blockhooks-csc.t (FAILED Non-zero exit status: 255 Bad plan. You planned 12 tests but ran 0.)
          [stdio] -Dcc="ccache gcc" -Duseithreads DEBUGGING
    
      ../ext/XS-APItest/t/sym-hook.t (FAILED Non-zero exit status: 255 No plan found in TAP output)
          [stdio] -Dcc="ccache gcc" -Duseithreads DEBUGGING
    
      ../ext/XS-APItest/t/rmagical.t (FAILED 1 Non-zero exit status: 255 Bad plan. You planned 3 tests but ran 1.)
          [stdio] -Dcc="ccache gcc" -Duseithreads DEBUGGING
    
      ../ext/XS-APItest/t/coplabel.t (FAILED Non-zero exit status: 255 Bad plan. You planned 1 tests but ran 0.)
          [stdio] -Dcc="ccache gcc" -Duseithreads DEBUGGING
    
      ../ext/XS-APItest/t/my_cxt.t (FAILED 1 Non-zero exit status: 255 Bad plan. You planned 16 tests but ran 1.)
          [stdio] -Dcc="ccache gcc" -Duseithreads DEBUGGING
    
      ../ext/XS-APItest/t/op.t (FAILED 1 Non-zero exit status: 255)
          [stdio] -Dcc="ccache gcc" -Duseithreads DEBUGGING
    
      ../ext/XS-APItest/t/handy00.t (FAILED No plan found in TAP output)
          [stdio] -Dcc="ccache gcc" -Duseithreads DEBUGGING
    
    Compiler messages:
        None.
    

    About this smoke:
    smoking-perl: 5.32.1
    smoker-version: 1.72/0.046
    timestamp: 2024-05-29T06:08:06Z
    tester: perl
    
    Smoke logs available at http://m-l.org/~perl/smoke/perl/aarch64-linux-gnu-thread-multi/blead_gcc_quick/logc729e47cb91f797fa10d8df6772de79066a941ac.log.gz