• Reports by commit
  • Recent reports
  • Perl5 CoreSmokeDB
  • Changes
  • Smoke v5.40.0-RC1-1-gc729e47cb9 FAIL(F) MSWin32 Win10 Build 19045 (64-bit) AMD Ryzen 7 5700G with Radeon Graphics (~3793 MHz) 2

    Automated smoke report for branch blead 5.40.0 patch c729e47cb91f797fa10d8df6772de79066a941ac v5.40.0-RC1-1-gc729e47cb9.
    winbonne10: AMD Ryzen 7 5700G with Radeon Graphics (~3793 MHz) (amd64/2 cpus)
        on        MSWin32 Win10 Build 19045 (64-bit)
        using     gcc version 13.2.0 (*1)
        smoketime 10 hours 13 minutes (average 1 hour 42 minutes)
    
    Summary: FAIL(F)
    
    O = OK  F = Failure(s), extended report at the bottom
    X = Failure(s) under TEST but not under harness
    ? = still running or test results not (yet) available
    Build failures during:       - = unknown or N/A
    c = Configure, m = make, M = make (after miniperl), t = make test-prep
    
    v5.40.0-RC1-1-gc729e47cb9
    ----------------------- ----------------------------------------------------
    F  F  F  F              -Duselargefiles -DCCTYPE=GCC -DCCHOME=C:\mingw64 -Dcf_email=abeltje@cpan.org -Aldflags='-static -static-libgcc -static-libstdc++' (*1)
    F  F  F  F              -Duselargefiles -Dusequadmath -DCCTYPE=GCC -DCCHOME=C:\mingw64 -Dcf_email=abeltje@cpan.org -Aldflags='-static -static-libgcc -static-libstdc++' (*1)
    F  F  F  F              -Duselargefiles -UWIN64 -Duse64bitint -DCCTYPE=GCC -DCCHOME=C:\mingw64 -Dcf_email=abeltje@cpan.org -Aldflags='-static -static-libgcc -static-libstdc++' (*1)
    |  |  |  |
    |  |  |  +------------  locale:.utf8 DEBUGGING
    |  |  +---------------  perlio DEBUGGING
    |  +------------------  locale:.utf8
    +---------------------  perlio
    
      Applied patches:
        RC1
    uncommitted-changes
    SMOKEc729e47cb91f797fa10d8df6772de79066a941ac
    Skipped tests:
        None.
    
    Test failures:
      ../ext/POSIX/t/time.t (FAILED 12-13 Non-zero exit status: 2)
          [perlio/locale:.utf8] -Duselargefiles -UWIN64 -Duse64bitint -DCCTYPE=GCC -DCCHOME=C:\mingw64 -Dcf_email=abeltje@cpan.org -Aldflags='-static -static-libgcc -static-libstdc++' DEBUGGING
          [perlio/locale:.utf8] -Duselargefiles -Dusequadmath -DCCTYPE=GCC -DCCHOME=C:\mingw64 -Dcf_email=abeltje@cpan.org -Aldflags='-static -static-libgcc -static-libstdc++'
          [perlio/locale:.utf8] -Duselargefiles -Dusequadmath -DCCTYPE=GCC -DCCHOME=C:\mingw64 -Dcf_email=abeltje@cpan.org -Aldflags='-static -static-libgcc -static-libstdc++' DEBUGGING
          [perlio/locale:.utf8] -Duselargefiles -DCCTYPE=GCC -DCCHOME=C:\mingw64 -Dcf_email=abeltje@cpan.org -Aldflags='-static -static-libgcc -static-libstdc++' DEBUGGING
          [perlio/locale:.utf8] -Duselargefiles -DCCTYPE=GCC -DCCHOME=C:\mingw64 -Dcf_email=abeltje@cpan.org -Aldflags='-static -static-libgcc -static-libstdc++'
          [perlio/locale:.utf8] -Duselargefiles -UWIN64 -Duse64bitint -DCCTYPE=GCC -DCCHOME=C:\mingw64 -Dcf_email=abeltje@cpan.org -Aldflags='-static -static-libgcc -static-libstdc++'
    
      ../t/op/magic.t (FAILED 186-187)
          [perlio/locale:.utf8] -Duselargefiles -UWIN64 -Duse64bitint -DCCTYPE=GCC -DCCHOME=C:\mingw64 -Dcf_email=abeltje@cpan.org -Aldflags='-static -static-libgcc -static-libstdc++'
          [perlio/locale:.utf8] -Duselargefiles -DCCTYPE=GCC -DCCHOME=C:\mingw64 -Dcf_email=abeltje@cpan.org -Aldflags='-static -static-libgcc -static-libstdc++'
          [perlio/locale:.utf8] -Duselargefiles -DCCTYPE=GCC -DCCHOME=C:\mingw64 -Dcf_email=abeltje@cpan.org -Aldflags='-static -static-libgcc -static-libstdc++' DEBUGGING
          [perlio/locale:.utf8] -Duselargefiles -Dusequadmath -DCCTYPE=GCC -DCCHOME=C:\mingw64 -Dcf_email=abeltje@cpan.org -Aldflags='-static -static-libgcc -static-libstdc++' DEBUGGING
          [perlio/locale:.utf8] -Duselargefiles -Dusequadmath -DCCTYPE=GCC -DCCHOME=C:\mingw64 -Dcf_email=abeltje@cpan.org -Aldflags='-static -static-libgcc -static-libstdc++'
          [perlio/locale:.utf8] -Duselargefiles -UWIN64 -Duse64bitint -DCCTYPE=GCC -DCCHOME=C:\mingw64 -Dcf_email=abeltje@cpan.org -Aldflags='-static -static-libgcc -static-libstdc++' DEBUGGING
    
      ../cpan/Win32/t/Unicode.t (FAILED 4-5)
          [perlio/locale:.utf8] -Duselargefiles -UWIN64 -Duse64bitint -DCCTYPE=GCC -DCCHOME=C:\mingw64 -Dcf_email=abeltje@cpan.org -Aldflags='-static -static-libgcc -static-libstdc++'
          [perlio/locale:.utf8] -Duselargefiles -DCCTYPE=GCC -DCCHOME=C:\mingw64 -Dcf_email=abeltje@cpan.org -Aldflags='-static -static-libgcc -static-libstdc++'
          [perlio/locale:.utf8] -Duselargefiles -UWIN64 -Duse64bitint -DCCTYPE=GCC -DCCHOME=C:\mingw64 -Dcf_email=abeltje@cpan.org -Aldflags='-static -static-libgcc -static-libstdc++' DEBUGGING
          [perlio/locale:.utf8] -Duselargefiles -Dusequadmath -DCCTYPE=GCC -DCCHOME=C:\mingw64 -Dcf_email=abeltje@cpan.org -Aldflags='-static -static-libgcc -static-libstdc++'
          [perlio/locale:.utf8] -Duselargefiles -Dusequadmath -DCCTYPE=GCC -DCCHOME=C:\mingw64 -Dcf_email=abeltje@cpan.org -Aldflags='-static -static-libgcc -static-libstdc++' DEBUGGING
          [perlio/locale:.utf8] -Duselargefiles -DCCTYPE=GCC -DCCHOME=C:\mingw64 -Dcf_email=abeltje@cpan.org -Aldflags='-static -static-libgcc -static-libstdc++' DEBUGGING
    
        Test todo-passed:
        ../ext/IPC-Open3/t/IPC-Open3.t (25)
          [perlio/locale:.utf8] -Duselargefiles -Dusequadmath -DCCTYPE=GCC -DCCHOME=C:\mingw64 -Dcf_email=abeltje@cpan.org -Aldflags='-static -static-libgcc -static-libstdc++' DEBUGGING
          [perlio/locale:.utf8] -Duselargefiles -DCCTYPE=GCC -DCCHOME=C:\mingw64 -Dcf_email=abeltje@cpan.org -Aldflags='-static -static-libgcc -static-libstdc++' DEBUGGING
          [perlio/locale:.utf8] -Duselargefiles -Dusequadmath -DCCTYPE=GCC -DCCHOME=C:\mingw64 -Dcf_email=abeltje@cpan.org -Aldflags='-static -static-libgcc -static-libstdc++'
          [perlio/locale:.utf8] -Duselargefiles -UWIN64 -Duse64bitint -DCCTYPE=GCC -DCCHOME=C:\mingw64 -Dcf_email=abeltje@cpan.org -Aldflags='-static -static-libgcc -static-libstdc++' DEBUGGING
          [perlio/locale:.utf8] -Duselargefiles -DCCTYPE=GCC -DCCHOME=C:\mingw64 -Dcf_email=abeltje@cpan.org -Aldflags='-static -static-libgcc -static-libstdc++'
          [perlio/locale:.utf8] -Duselargefiles -UWIN64 -Duse64bitint -DCCTYPE=GCC -DCCHOME=C:\mingw64 -Dcf_email=abeltje@cpan.org -Aldflags='-static -static-libgcc -static-libstdc++'
        
    Compiler messages:
        ..\toke.c: In function 'Perl_scan_num':
        ..\toke.c:12036:9: warning: 'shift' may be used uninitialized [-Wmaybe-uninitialized]
        ..\pp_sys.c: In function 'Perl_pp_shostent':
        ..\pp_sys.c:5583:15: warning: unused variable 'stayopen' [-Wunused-variable]
        ..\pp_hot.c: In function 'Perl_pp_aelemfastlex_store':
        ..\pp_hot.c:363:27: warning: array subscript has type 'char' [-Wchar-subscripts]
        ..\pp_hot.c: In function 'Perl_pp_aelemfast':
        ..\pp_hot.c:2050:25: warning: array subscript has type 'char' [-Wchar-subscripts]
        ..\utf8.c: In function 'S__to_utf8_case':
        ..\utf8.c:3537:48: warning: 'remaining_list' may be used uninitialized [-Wmaybe-uninitialized]
        ..\embed.h:794:90: note: in definition of macro 'uvoffuni_to_utf8_flags_msgs'
        ..\utf8.h:292:40: note: in expansion of macro 'ASSERT_NOT_PTR'
        ..\utf8.h:154:47: note: in expansion of macro 'NATIVE_TO_UNI'
        ..\utf8.h:152:37: note: in expansion of macro 'uvchr_to_utf8_flags_msgs'
        ..\utf8.h:150:37: note: in expansion of macro 'uvchr_to_utf8_flags'
        ..\utf8.c:3537:17: note: in expansion of macro 'uvchr_to_utf8'
        ..\utf8.c:3511:17: note: 'remaining_list' was declared here
        ..\locale.c: In function 'S_ints_to_tm':
        ..\locale.c:8213:33: warning: unused parameter 'locale' [-Wunused-parameter]
        ..\locale.c:867:19: warning: 'category_available' defined but not used [-Wunused-const-variable=]
        ..\mg.c: In function 'Perl_magic_setenv':
        ..\mg.c:1302:12: warning: variable 'len' set but not used [-Wunused-but-set-variable]
        ..\mg.c: In function 'Perl_perly_sighandler':
        ..\mg.c:3664:54: warning: unused parameter 'safe' [-Wunused-parameter]
        ..\util.c: In function 'sig_trap':
        ..\util.c:3075:14: warning: unused parameter 'signo' [-Wunused-parameter]
        ..\util.c: In function 'Perl_find_script':
        ..\util.c:3521:39: warning: comparison of integer expressions of different signedness: 'long int' and 'long long unsigned int' [-Wsign-compare]
        ..\util.c:3546:25: warning: comparison of integer expressions of different signedness: 'I32' {aka 'long int'} and 'long long unsigned int' [-Wsign-compare]
        ..\util.c:3549:21: warning: comparison of integer expressions of different signedness: 'I32' {aka 'long int'} and 'long long unsigned int' [-Wsign-compare]
        win32.c: In function 'set_w32_module_name':
        win32.c:245:9: warning: cast between incompatible function types from 'FARPROC' {aka 'long long int (*)()'} to 'DWORD (*)(const WCHAR *, WCHAR *, DWORD)' {aka 'long unsigned int (*)(const short unsigned int *, short unsigned int *, long unsigned int)'} [-Wcast-function-type]
        win32.c: In function 'win32_stat_low':
        win32.c:1690:25: warning: cast between incompatible function types from 'FARPROC' {aka 'long long int (*)()'} to 'DWORD (*)(void *, CHAR *, DWORD,  DWORD)' {aka 'long unsigned int (*)(void *, char *, long unsigned int,  long unsigned int)'} [-Wcast-function-type]
        win32.c: In function 'win32_hook_closehandle_in_crt':
        win32.c:5392:24: warning: cast between incompatible function types from 'FARPROC' {aka 'long long int (*)()'} to 'BOOL (*)(void *)' {aka 'int (*)(void *)'} [-Wcast-function-type]
        win32.c:5399:36: warning: cast between incompatible function types from 'BOOL (*)(void *)' {aka 'int (*)(void *)'} to 'INT_PTR (*)()' {aka 'long long int (*)()'} [-Wcast-function-type]
        win32.c:5402:31: warning: cast between incompatible function types from 'FARPROC' {aka 'long long int (*)()'} to 'NTSTATUS (*)(void *, struct _IO_STATUS_BLOCK *, void *, ULONG,  ULONG)' {aka 'long int (*)(void *, struct _IO_STATUS_BLOCK *, void *, long unsigned int,  long unsigned int)'} [-Wcast-function-type]
        win32.c: In function 'win32_unhook_closehandle_in_crt':
        win32.c:5426:36: warning: cast between incompatible function types from 'pCloseHandle' {aka 'int (*)(void *)'} to 'INT_PTR (*)()' {aka 'long long int (*)()'} [-Wcast-function-type]
        win32sck.c: In function 'win32_getnetbyname':
        win32sck.c:781:26: warning: unused parameter 'name' [-Wunused-parameter]
        win32sck.c: In function 'win32_getnetbyaddr':
        win32sck.c:788:25: warning: unused parameter 'net' [-Wunused-parameter]
        win32sck.c:788:34: warning: unused parameter 'type' [-Wunused-parameter]
        win32sck.c: In function 'win32_sethostent':
        win32sck.c:809:22: warning: unused parameter 'stayopen' [-Wunused-parameter]
        win32sck.c: In function 'win32_setnetent':
        win32sck.c:816:21: warning: unused parameter 'stayopen' [-Wunused-parameter]
        win32sck.c: In function 'win32_setprotoent':
        win32sck.c:823:23: warning: unused parameter 'stayopen' [-Wunused-parameter]
        win32sck.c: In function 'win32_setservent':
        win32sck.c:830:22: warning: unused parameter 'stayopen' [-Wunused-parameter]
        win32thread.c: In function 'Perl_set_context':
        win32thread.c:9:24: warning: unused parameter 't' [-Wunused-parameter]
        fcrypt.c: In function 'des_fcrypt':
        fcrypt.c:473:17: warning: suggest parentheses around '&&' within '||' [-Wparentheses]
        fcrypt.c:488:14: note: in expansion of macro 'good_for_salt'
        fcrypt.c:474:17: warning: suggest parentheses around '&&' within '||' [-Wparentheses]
        fcrypt.c:488:41: note: in expansion of macro 'good_for_salt'
        RealPPPort.xs: In function 'XS_Devel__PPPort_ptrtests':
        ..\..\lib\CORE/perl.h:2496:33: warning: cast from pointer to integer of different size [-Wpointer-to-int-cast]
        ..\..\lib\CORE/perl.h:2509:25: note: in expansion of macro 'INT2PTR'
        RealPPPort.xs:1884:27: note: in expansion of macro 'PTR2ul'
        POSIX.xs: In function 'fix_win32_tzenv':
        POSIX.xs:1725:13: warning: implicit declaration of function 'putenv'; did you mean '_putenv'? [-Wimplicit-function-declaration]
        POSIX.xs: In function 'XS_POSIX_acos':
        POSIX.xs:604:23: warning: implicit declaration of function 'j0' [-Wimplicit-function-declaration]
        POSIX.xs:2196:22: note: in expansion of macro 'bessel_j0'
        POSIX.xs:605:23: warning: implicit declaration of function 'j1' [-Wimplicit-function-declaration]
        POSIX.xs:2203:22: note: in expansion of macro 'bessel_j1'
        POSIX.xs:607:23: warning: implicit declaration of function 'y0' [-Wimplicit-function-declaration]
        POSIX.xs:2290:22: note: in expansion of macro 'bessel_y0'
        POSIX.xs:608:23: warning: implicit declaration of function 'y1' [-Wimplicit-function-declaration]
        POSIX.xs:2298:22: note: in expansion of macro 'bessel_y1'
        POSIX.xs: In function 'XS_POSIX_fpclassify':
        ..\..\lib\CORE/perl.h:2794:33: warning: implicit declaration of function 'finite'; did you mean '_finite'? [-Wimplicit-function-declaration]
        POSIX.xs:2413:22: note: in expansion of macro 'Perl_isfinite'
        POSIX.xs: In function 'XS_POSIX_jn':
        POSIX.xs:606:23: warning: implicit declaration of function 'jn' [-Wimplicit-function-declaration]
        POSIX.xs:2766:20: note: in expansion of macro 'bessel_jn'
        POSIX.xs:609:23: warning: implicit declaration of function 'yn' [-Wimplicit-function-declaration]
        POSIX.xs:2776:20: note: in expansion of macro 'bessel_yn'
        perl.c: In function 'Perl_doing_taint':
        perl.c:4374:48: warning: unused parameter 'envp' [-Wunused-parameter]
        ..\locale.c:3334:1: warning: 'S_get_LC_ALL_display' defined but not used [-Wunused-function]
        perlhost.h: In function 'CPerlHost* IPerlMem2Host(IPerlMem*)':
        perlhost.h:227:63: warning: 'offsetof' within non-standard-layout type 'CPerlHost' is conditionally-supported [-Winvalid-offsetof]
        perlhost.h:241:12: note: in expansion of macro 'STRUCT2RAWPTR'
        perlhost.h: In function 'CPerlHost* IPerlMemShared2Host(IPerlMem*)':
        perlhost.h:246:12: note: in expansion of macro 'STRUCT2RAWPTR'
        perlhost.h: In function 'CPerlHost* IPerlMemParse2Host(IPerlMem*)':
        perlhost.h:251:12: note: in expansion of macro 'STRUCT2RAWPTR'
        perlhost.h: In function 'CPerlHost* IPerlEnv2Host(IPerlEnv*)':
        perlhost.h:234:38: note: in expansion of macro 'STRUCT2RAWPTR'
        perlhost.h:256:12: note: in expansion of macro 'STRUCT2PTR'
        perlhost.h: In function 'CPerlHost* IPerlStdIO2Host(IPerlStdIO*)':
        perlhost.h:261:12: note: in expansion of macro 'STRUCT2PTR'
        perlhost.h: In function 'CPerlHost* IPerlLIO2Host(IPerlLIO*)':
        perlhost.h:266:12: note: in expansion of macro 'STRUCT2PTR'
        perlhost.h: In function 'CPerlHost* IPerlDir2Host(IPerlDir*)':
        perlhost.h:271:12: note: in expansion of macro 'STRUCT2PTR'
        perlhost.h: In function 'CPerlHost* IPerlSock2Host(IPerlSock*)':
        perlhost.h:276:12: note: in expansion of macro 'STRUCT2PTR'
        perlhost.h: In function 'CPerlHost* IPerlProc2Host(IPerlProc*)':
        perlhost.h:281:12: note: in expansion of macro 'STRUCT2PTR'
        perllib.c: In function 'void win32_checkTLS(PerlInterpreter*)':
        perllib.c:54:14: warning: unused variable 'nowhere' [-Wunused-variable]
        perllib.c: In function 'void win32_delete_internal_host(void*)':
        perllib.c:164:5: warning: deleting object of polymorphic class type 'CPerlHost' which has non-virtual destructor might cause undefined behavior [-Wdelete-non-virtual-dtor]
        perllib.c: In function 'BOOL DllMain(HINSTANCE, DWORD, LPVOID)':
        perllib.c:234:16: warning: unused parameter 'lpvReserved' [-Wunused-parameter]
        vdir.h:458:1: warning: function may return address of local variable [-Wreturn-local-addr]
        vdir.h:391:10: note: declared here
        vdir.h:689:1: warning: function may return address of local variable [-Wreturn-local-addr]
        vdir.h:623:11: note: declared here
        ..\pp_sys.c: In function 'Perl_pp_glob':
        ..\embed.h:746:49: warning: 'tmpsv' may be used uninitialized [-Wmaybe-uninitialized]
        ..\sv.h:2213:9: note: in expansion of macro 'sv_setsv_flags'
        ..\pp_sys.c:421:13: note: in expansion of macro 'sv_setsv'
        ..\pp_sys.c:395:9: note: 'tmpsv' was declared here
        ..\pp_hot.c: In function 'Perl_pp_readline':
        ..\pp_hot.c:1629:17: note: in expansion of macro 'sv_setsv'
        ..\pp_hot.c:1597:13: note: 'tmpsv' was declared here
        ..\locale.c: In function 'S_parse_LC_ALL_string':
        ..\locale.c:1473:11: warning: 'msg' may be used uninitialized [-Wmaybe-uninitialized]
        ..\locale.c:1450:18: note: 'msg' was declared here
        DynaLoader.xs: In function 'XS_DynaLoader_dl_unload_file':
        dlutils.c:66:32: note: in definition of macro 'DLDEBUG'
        DynaLoader.xs:152:71: note: in expansion of macro 'PTR2ul'
        compress.c: In function 'sendMTFValues':
        compress.c:528:4: warning: 'nSelectors' may be used uninitialized [-Wmaybe-uninitialized]
        compress.c:248:10: note: 'nSelectors' was declared here
        RealPPPort.xs: In function 'XS_Devel__PPPort_croak_NVgf':
        RealPPPort.xs:1032:34: warning: unknown conversion type character 'Q' in format [-Wformat=]
        RealPPPort.xs:1032:34: warning: too many arguments for format [-Wformat-extra-args]
    

    About this smoke:
    smoking-perl: 5.38.0
    smoker-version: 1.81/0.047
    timestamp: 2024-05-29T20:03:07Z
    tester: abeltje
    
    For these MSWin32 builds -Duseithreads is always on (except for -Uuseithreads) gccversion=64 x86_64-ucrt-posix-seh, built by Brecht Sanders) 13.2.0 This Windows has (experimental) UTF-8 enabled