• Reports by commit
  • Recent reports
  • Perl5 CoreSmokeDB
  • Changes
  • Smoke v5.40.0-RC1-10-g121cb45e8f FAIL(F) darwin 18.7.0) MacBook Air (2 GHz) 1[2 cores]

    Automated smoke report for branch blead 5.40.0 patch 121cb45e8f6c507d1bac1c67fc71be0dbda02c18 v5.40.0-RC1-10-g121cb45e8f.
    iTunes-MacBook-Air-Ethernet.local: MacBook Air (2 GHz) (Intel Core i7/1[2 cores] cpus)
        on        darwin 18.7.0)
        using     cc version 4.2.1 Compatible Apple LLVM 11.0.0 (clang-1100.0.33.17) (*1)
        smoketime 14 hours 24 minutes (average 48 minutes)
    
    Summary: FAIL(F)
    
    O = OK  F = Failure(s), extended report at the bottom
    X = Failure(s) under TEST but not under harness
    ? = still running or test results not (yet) available
    Build failures during:       - = unknown or N/A
    c = Configure, m = make, M = make (after miniperl), t = make test-prep
    
    v5.40.0-RC1-10-g121cb45e8f
    ----------------------- ----------------------------------------------------
    F  F                    -Uuseperlio (*1)
    F  F                     (*1)
    F  F                    -Duse64bitint (*1)
    F  F                    -Duselongdouble (*1)
    F  F                    -Dusemorebits (*1)
    F  F                    -Duseithreads (*1)
    F  F                    -Duseithreads -Duse64bitint (*1)
    F  F                    -Duseithreads -Duselongdouble (*1)
    F  F                    -Duseithreads -Dusemorebits (*1)
    |  |
    |  +------------------  stdio DEBUGGING
    +---------------------  stdio
    
    Testsuite was run only with 'harness'
    
      Applied patches:
        RC1
    uncommitted-changes
    Skipped tests:
        None.
    
    Test failures:
      ../cpan/IPC-SysV/t/ipcsysv.t (FAILED Non-zero exit status: 255 Bad plan. You planned 39 tests but ran 0.)
          [stdio] -Duseithreads
          [stdio] -Uuseperlio
          [stdio] -Duselongdouble DEBUGGING
          [stdio] -Uuseperlio DEBUGGING
          [stdio] -Duseithreads -Duselongdouble DEBUGGING
          [stdio] -Dusemorebits
          [stdio] -Duse64bitint DEBUGGING
          [stdio] -Duseithreads -Duse64bitint DEBUGGING
          [stdio] -Duseithreads DEBUGGING
          [stdio] 
          [stdio] -Duseithreads -Duse64bitint
          [stdio]  DEBUGGING
          [stdio] -Duseithreads -Duselongdouble
          [stdio] -Duselongdouble
          [stdio] -Dusemorebits DEBUGGING
          [stdio] -Duseithreads -Dusemorebits
          [stdio] -Duseithreads -Dusemorebits DEBUGGING
          [stdio] -Duse64bitint
    
      ../cpan/IPC-SysV/t/msg.t (FAILED 2 Non-zero exit status: 4)
          [stdio] -Duselongdouble
          [stdio] -Duseithreads -Duselongdouble
          [stdio] -Duse64bitint
          [stdio] -Duseithreads -Dusemorebits
          [stdio] -Dusemorebits DEBUGGING
          [stdio] -Duseithreads -Dusemorebits DEBUGGING
          [stdio] -Duseithreads -Duse64bitint DEBUGGING
          [stdio] -Duseithreads DEBUGGING
          [stdio] 
          [stdio]  DEBUGGING
          [stdio] -Duseithreads -Duse64bitint
          [stdio] -Uuseperlio DEBUGGING
          [stdio] -Duse64bitint DEBUGGING
          [stdio] -Duseithreads -Duselongdouble DEBUGGING
          [stdio] -Dusemorebits
          [stdio] -Uuseperlio
          [stdio] -Duseithreads
          [stdio] -Duselongdouble DEBUGGING
    
      ../t/io/msg.t (FAILED 2-5)
          [stdio] -Duselongdouble DEBUGGING
          [stdio] -Uuseperlio
          [stdio] -Duseithreads
          [stdio] -Duse64bitint DEBUGGING
          [stdio] -Dusemorebits
          [stdio] -Duseithreads -Duselongdouble DEBUGGING
          [stdio] -Uuseperlio DEBUGGING
          [stdio] -Duseithreads -Duse64bitint
          [stdio]  DEBUGGING
          [stdio] 
          [stdio] -Duseithreads DEBUGGING
          [stdio] -Duseithreads -Duse64bitint DEBUGGING
          [stdio] -Duse64bitint
          [stdio] -Duseithreads -Dusemorebits DEBUGGING
          [stdio] -Dusemorebits DEBUGGING
          [stdio] -Duseithreads -Dusemorebits
          [stdio] -Duselongdouble
          [stdio] -Duseithreads -Duselongdouble
    
    Compiler messages:
        (See log because mailing list size limit is too small.)
    

    About this smoke:
    smoking-perl: 5.18.4
    smoker-version: 1.72/0.046
    timestamp: 2024-05-31T10:36:23Z
    tester: perl
    
    Enabled stack-use-after-return (Linux/Darwin) and leak-detection (Linux). Smoke logs available at http://m-l.org/~perl/smoke/perl/darwin-thread-multi-2level/blead_clang_quick_sanitize=address/log121cb45e8f6c507d1bac1c67fc71be0dbda02c18.log.gz