• Reports by commit
  • Recent reports
  • Perl5 CoreSmokeDB
  • Changes
  • Smoke v5.41.0-4-g03b7e3a1b2f FAIL(F) linux 5.10.103-v7l+ [Raspbian GNU/Linux 10.13] ARMv7 Processor rev 3 (v7l) (300 MHz) 4

    Automated smoke report for branch blead 5.41.1 patch 03b7e3a1b2f9019c0c0c94fd0dd93c3aa5ddfb74 v5.41.0-4-g03b7e3a1b2f.
    develpi.local: ARMv7 Processor rev 3 (v7l) (300 MHz) (armv7l/4 cpus)
        on        linux 5.10.103-v7l+ [Raspbian GNU/Linux 10.13]
        using     ccache gcc version 8.3.0 (*1)
        smoketime 1 hour 54 minutes (average 28 minutes 44 seconds)
    
    Summary: FAIL(F)
    
    O = OK  F = Failure(s), extended report at the bottom
    X = Failure(s) under TEST but not under harness
    ? = still running or test results not (yet) available
    Build failures during:       - = unknown or N/A
    c = Configure, m = make, M = make (after miniperl), t = make test-prep
    
    v5.41.0-4-g03b7e3a1b2f
    ----------------------- ----------------------------------------------------
    F  F                    -Dcc="ccache gcc" (*1)
    F  F                    -Dcc="ccache gcc" -Duseithreads (*1)
    |  |
    |  +------------------  stdio DEBUGGING
    +---------------------  stdio
    
    Testsuite was run only with 'harness'
    
    Skipped tests:
        None.
    
    Test failures:
      ../dist/Module-CoreList/t/corelist.t (FAILED 8 Non-zero exit status: 5)
          [stdio] -Dcc="ccache gcc" -Duseithreads
          [stdio] -Dcc="ccache gcc" -Duseithreads DEBUGGING
          [stdio] -Dcc="ccache gcc" DEBUGGING
          [stdio] -Dcc="ccache gcc"
    
      ../t/porting/corelist.t (FAILED 3)
          [stdio] -Dcc="ccache gcc" -Duseithreads
          [stdio] -Dcc="ccache gcc" -Duseithreads DEBUGGING
          [stdio] -Dcc="ccache gcc"
          [stdio] -Dcc="ccache gcc" DEBUGGING
    
      ../dist/Module-CoreList/t/maintainer.t (FAILED 4-5 Non-zero exit status: 2)
          [stdio] -Dcc="ccache gcc" -Duseithreads
          [stdio] -Dcc="ccache gcc" -Duseithreads DEBUGGING
          [stdio] -Dcc="ccache gcc"
          [stdio] -Dcc="ccache gcc" DEBUGGING
    
    Compiler messages:
        scope.c: In function ‘Perl_leave_scope’:
        handy.h:99:35: warning: ‘a2.any_uv’ may be used uninitialized in this function [-Wmaybe-uninitialized]
        scope.c:1117:21: note: ‘a2.any_uv’ was declared here
        scope.c:1117:21: warning: ‘a2.any_uv’ may be used uninitialized in this function [-Wmaybe-uninitialized]
    

    About this smoke:
    smoking-perl: 5.28.1
    smoker-version: 1.72/0.046
    timestamp: 2024-06-10T17:12:41Z
    tester: perl
    
    Smoke logs available at http://m-l.org/~perl/smoke/perl/arm-linux-gnueabihf-thread-multi-64int/blead_gcc_quick/log03b7e3a1b2f9019c0c0c94fd0dd93c3aa5ddfb74.log.gz