• Reports by commit
  • Recent reports
  • Perl5 CoreSmokeDB
  • Changes
  • Smoke v5.41.0-4-g03b7e3a1b2f FAIL(F) linux 6.1.21-v8+ [Debian GNU/Linux 11.9] (100 MHz) 4

    Automated smoke report for branch blead 5.41.1 patch 03b7e3a1b2f9019c0c0c94fd0dd93c3aa5ddfb74 v5.41.0-4-g03b7e3a1b2f.
    develpi64:  (100 MHz) (aarch64/4 cpus)
        on        linux 6.1.21-v8+ [Debian GNU/Linux 11.9]
        using     ccache gcc version 10.2.1 20210110 (*1)
        smoketime 2 hours 11 minutes (average 32 minutes 48 seconds)
    
    Summary: FAIL(F)
    
    O = OK  F = Failure(s), extended report at the bottom
    X = Failure(s) under TEST but not under harness
    ? = still running or test results not (yet) available
    Build failures during:       - = unknown or N/A
    c = Configure, m = make, M = make (after miniperl), t = make test-prep
    
    v5.41.0-4-g03b7e3a1b2f
    ----------------------- ----------------------------------------------------
    F  F                    -Dcc="ccache gcc" (*1)
    F  F                    -Dcc="ccache gcc" -Duseithreads (*1)
    |  |
    |  +------------------  stdio DEBUGGING
    +---------------------  stdio
    
    Testsuite was run only with 'harness'
    
    Skipped tests:
        None.
    
    Test failures:
      ../dist/Module-CoreList/t/corelist.t (FAILED 8 Non-zero exit status: 5)
          [stdio] -Dcc="ccache gcc" -Duseithreads
          [stdio] -Dcc="ccache gcc" DEBUGGING
          [stdio] -Dcc="ccache gcc"
          [stdio] -Dcc="ccache gcc" -Duseithreads DEBUGGING
    
      ../dist/Module-CoreList/t/maintainer.t (FAILED 4-5 Non-zero exit status: 2)
          [stdio] -Dcc="ccache gcc"
          [stdio] -Dcc="ccache gcc" DEBUGGING
          [stdio] -Dcc="ccache gcc" -Duseithreads DEBUGGING
          [stdio] -Dcc="ccache gcc" -Duseithreads
    
      ../t/porting/corelist.t (FAILED 3)
          [stdio] -Dcc="ccache gcc"
          [stdio] -Dcc="ccache gcc" DEBUGGING
          [stdio] -Dcc="ccache gcc" -Duseithreads DEBUGGING
          [stdio] -Dcc="ccache gcc" -Duseithreads
    
    Compiler messages:
        None.
    

    About this smoke:
    smoking-perl: 5.32.1
    smoker-version: 1.72/0.046
    timestamp: 2024-06-10T17:11:28Z
    tester: perl
    
    Smoke logs available at http://m-l.org/~perl/smoke/perl/aarch64-linux-gnu-thread-multi/blead_gcc_quick/log03b7e3a1b2f9019c0c0c94fd0dd93c3aa5ddfb74.log.gz