• Reports by commit
  • Recent reports
  • Perl5 CoreSmokeDB
  • Changes
  • Smoke [blead] v5.39.4-45-ga254546846 PASS netbsd 8.2 (amd64/1 cpu)

    Subject: Smoke [blead] v5.39.4-45-ga254546846 PASS netbsd 8.2 (amd64/1 cpu)
    Message-Id: <20231110030233.6F9104F624F@cjg-netbsd8>
    Date: Thu,  9 Nov 2023 22:02:33 -0500 (EST)
    
    Automated smoke report for branch blead 5.39.5 patch a25454684620250d9ad52bc069063b8149bf7628 v5.39.4-45-ga254546846
    cjg-netbsd8: Intel 686-class (amd64/1 cpu)
        on        netbsd - 8.2
        using     g++ version 5.5.0
        smoketime 3 hours 36 minutes (average 27 minutes 4 seconds)
    
    Summary: PASS
    
    O = OK  F = Failure(s), extended report at the bottom
    X = Failure(s) under TEST but not under harness
    ? = still running or test results not (yet) available
    Build failures during:       - = unknown or N/A
    c = Configure, m = make, M = make (after miniperl), t = make test-prep
    
    v5.39.4-45-ga254546846  Configuration (common) -Accflags='-DPERL_RC_STACK -DDEBUG_LEAKING_SCALARS' -Dcc=g++
    ----------- ---------------------------------------------------------
    O O         
    O O         -Duse64bitall
    O O         -Duseithreads
    O O         -Duseithreads -Duse64bitall
    | +--------- -DDEBUGGING
    +----------- no debugging
    
    
    Testsuite was run only with 'harness'
    
    Tests skipped on user request:
        # One test name on a line
    MANIFEST did not declare '.mailmap'
    
    Passed Todo tests: (common-args) -Accflags='-DPERL_RC_STACK -DDEBUG_LEAKING_SCALARS' -Dcc=g++
    [default] 
    [default] -DDEBUGGING
    [default] -Duse64bitall
    [default] -DDEBUGGING -Duse64bitall
    [default] -Duseithreads
    [default] -DDEBUGGING -Duseithreads
    [default] -Duseithreads -Duse64bitall
    [default] -DDEBUGGING -Duseithreads -Duse64bitall
    ../cpan/Time-Piece/t/06large.t..............................PASSED
        1-250
    ../lib/locale.t.............................................PASSED
        683
    
    Compiler messages(gcc):
    sv_inline.h:75:28: warning: unused parameter 'file' [-Wunused-parameter]
    sv_inline.h:75:38: warning: unused parameter 'line' [-Wunused-parameter]
    sv_inline.h:75:56: warning: unused parameter 'func' [-Wunused-parameter]
    locale.c: In function 'parse_LC_ALL_string_return S_parse_LC_ALL_string(const char*, const char**, parse_LC_ALL_STRING_action, bool, bool, line_t)':
    locale.c:1425:46: warning: 'msg' may be used uninitialized in this function [-Wmaybe-uninitialized]
    /usr/include/sys/cdefs_elf.h:67:20: error: missing binary operator before token "("
    /usr/include/sys/cdefs_elf.h:73:20: error: missing binary operator before token "("
    /usr/include/sys/cdefs_elf.h:79:20: error: missing binary operator before token "("
    ../../sv_inline.h:75:28: warning: unused parameter 'file' [-Wunused-parameter]
    ../../sv_inline.h:75:38: warning: unused parameter 'line' [-Wunused-parameter]
    ../../sv_inline.h:75:56: warning: unused parameter 'func' [-Wunused-parameter]
    ../../../sv_inline.h:75:28: warning: unused parameter 'file' [-Wunused-parameter]
    ../../../sv_inline.h:75:38: warning: unused parameter 'line' [-Wunused-parameter]
    ../../../sv_inline.h:75:56: warning: unused parameter 'func' [-Wunused-parameter]
    Socket.xs: In function 'void XS_Socket_inet_aton(CV*)':
    Socket.xs:784:35: warning: missing initializer for member 'addrinfo::ai_family' [-Wmissing-field-initializers]
    Socket.xs:784:35: warning: missing initializer for member 'addrinfo::ai_socktype' [-Wmissing-field-initializers]
    Socket.xs:784:35: warning: missing initializer for member 'addrinfo::ai_protocol' [-Wmissing-field-initializers]
    Socket.xs:784:35: warning: missing initializer for member 'addrinfo::ai_addrlen' [-Wmissing-field-initializers]
    Socket.xs:784:35: warning: missing initializer for member 'addrinfo::ai_canonname' [-Wmissing-field-initializers]
    Socket.xs:784:35: warning: missing initializer for member 'addrinfo::ai_addr' [-Wmissing-field-initializers]
    Socket.xs:784:35: warning: missing initializer for member 'addrinfo::ai_next' [-Wmissing-field-initializers]
    Socket.c: In function 'void XS_Socket_pack_ip_mreq_source(CV*)':
    Socket.c:1702:7: warning: variable 'interface' set but not used [-Wunused-but-set-variable]
    const-c.inc:351:42: warning: unused parameter 'iv_return' [-Wunused-parameter]
    ../../../../sv_inline.h:75:28: warning: unused parameter 'file' [-Wunused-parameter]
    ../../../../sv_inline.h:75:38: warning: unused parameter 'line' [-Wunused-parameter]
    ../../../../sv_inline.h:75:56: warning: unused parameter 'func' [-Wunused-parameter]
    locale.c: In function 'parse_LC_ALL_string_return S_parse_LC_ALL_string(PerlInterpreter*, const char*, const char**, parse_LC_ALL_STRING_action, bool, bool, line_t)':
    Socket.xs: In function 'void XS_Socket_inet_aton(PerlInterpreter*, CV*)':
    Socket.c: In function 'void XS_Socket_pack_ip_mreq_source(PerlInterpreter*, CV*)':
    
    Non-Fatal messages(gcc):
    
    
    
    -- 
    Report by Test::Smoke v1.71 running on perl 5.38.0
    (Reporter v0.053 / Smoker v0.046)